IBM UrbanCode Deploy fixlist

Each release and fix pack of IBM™ UrbanCode™ Deploy contains fixes for issues found in previous supported versions of the product. This list contains APARs fixed in the given release or fix pack. The release versions are sorted in newest to oldest order.

The security fixes are announced through security bulletins. More information can be found in IBM Security Vulnerability Management.

7.2.3.1.ifix01

This release replaces the IBM UrbanCode Deploy version 7.2.3.1 and includes all updates made in the 7.2.3.1 release.
PH48699 IN URBANCODE DEPLOY, AGENTS ARE SHOWING THE WRONG VENDOR'S NAME
PH48461 FIX FIXEMPTYREQUIREAPPROVALS.JAVA IN THE 7.2.3 UPGRADE

7.2.3.1

This release is replaced with version 7.2.3.1.ifix01. Version 7.2.3.1.ifix01 contains all updates added in version 7.2.3.1. Version 7.2.3.1 has been removed and not available to download. If you have installed version 7.2.3.1, install 7.2.3.1.ifix01 to prevent potential problems.
PH47053 COMPONENT PROPERTY INTERPOLATION BUG
PH46528 INTERMITTENT JAVA.LANG.ILLEGALSTATEEXCEPTION: SESSION/ENTITYMANAGER IS CLOSED ERRORS WHEN RUNNING PROCESSES
PH39583 UCR INTEGRATION FAILS WITH ERROR RESOLVING VERSION SELECTOR
PH45825 RE-IMPORTING AN APPLICATION TEMPLATE RECEIVED FROM ANOTHER UCD HOST FAILS WITH A NOTIFICATION SCHEME NAMED XX ALREADY EXISTS
PH45515 500 ERROR ON PLUGIN USAGE PAGE
PH44776 THE UI IS SLOW TO LOAD APPLICATION PROCESS REQUESTS. DEPLOYMENT TIMES ARE DOUBLE WHAT THEY SHOULD BE.
PH40765 DEPLOYMENTS FAIL WITH ERROR 'FAILED TO LAZILY INITIALIZE'
PH42433 IF VERSION STATUSES HAVE DOUBLE QUOTES IN THE DESCRIPTION, ENVIRONMENT GATES ARE NOT GETTING LOADED FOR APPLICATION.
PH38230 ARCHIVED VERSIONS CAN BE SELECTED FOR DEPLOYMENT
PH25158 DEPLOYMENT SCREEN WITH EXTRA FIELD WHEN APPLICATIONPROPERTY FIELDS ARE SET TO REQUIRED IN PROCESS STEP- UPGRADE FROM 6.2.7.3 TO 7.0.5.2

7.2.3.0.ifix01

This release replaces the IBM UrbanCode Deploy version 7.2.3 and includes all updates made in the 7.2.3 release.
PH48699 IN URBANCODE DEPLOY, AGENTS ARE SHOWING THE WRONG VENDOR'S NAME
PH48461 FIX FIXEMPTYREQUIREAPPROVALS.JAVA IN THE 7.2.3 UPGRADE

7.2.3

This release is replaced with version 7.2.3.0.ifix01. Version 7.2.3.0.ifix01 contains all updates added in version 7.2.3. Version 7.2.3 has been removed and not available to download. If you have installed version 7.2.3, install 7.2.3.0.ifix01 to prevent potential problems.
PH42047 ADD ACTIONS IS NOT AVAILABLE FROM ACTION MENU IF NON ADMIN USER HAS ONLY MANAGE CHILDREN PERMISSION ON RESOURCE TYPE

7.2.2.1

PH43074 SILENT INSTALLATION ON AGENT RELAY IS PROMPTING FOR WEB AGENT COMMUNICATION URL EVEN AFTER PROVIDING THE PROPERTY
PH42547 FAILED DEPLOYMENT ON COMPONENT TAG RESOURCE INVALIDATES INVENTORY FOR ALL COMPONENTS
PH42438 SAVING APPLICATION TEMPLATE AFTER UPGRADE TO 7.2.1.0 SHOWSCONSTRAINTVIOLATIONEXCEPTION MESSAGE.
PH41405 ON A COMPONENT, OVERRIDING A TEMPLATE ENVIRONMENT PROPERTY DEFINITION FAILS WITH ‘PROPDEF ALREADY EXISTS IN THIS PROPSHEETDEF’
PH40983 GETCOMPONENTVERSIONS COMMAND SHOULD HAVE INACTIVE PARAM THAT RETURNS ARCHIVED VERSIONS
PH39525 UNABLE TO DEPLOY WITHOUT PERMISSION ON UNUSED RESOURCES

7.2.2

PH41124 APPLICATIONTEMPLATE AND ENVIRONMENTTEMPLATE CHANGES TAB PAGINATES INCORRECTLY
PH39828 ALL PROPERTIES ARE UPDATED WHEN DOING BATCH EDIT OF COMPONENT ENVIRONMENT PROPERTIES INSTEAD OF INDIVIDUAL PROPERTY
PH39558 ONLY TAG ID IS DISPLAYED TO THE APPROVER THAT UNABLES THE APPROVER TO IDENTIFY THE TAGS TO APPROVE
PH39390 LOTS OF SCROLLING FOR COMPONENT TO SEE USEFUL INFORMATION FOR COMPONENTS USED BY LARGE NUMBER OF APPLICATIONS.
PH23273 IBM URBANCODE DEPLOY COMPONENT PLUG-IN VERSION 74 ARE NOT BACKWARD COMPATIBLE WITH PREVIOUS VERSIONS

7.2.1.2

PH42597 DOWNLOAD ARTIFACT STEP FAILS WITH TRUNCATEDCHUNKEXCEPTION AND RELAY ERRORS ‘PREMATURE END OF CHUNK CODED MESSAGE BODY’
PH42166 POST UPGRADE TO UCD 7.2.1 /REST/RELEASE/APPLICATIONPROCESSES?MODIFIEDAFTER= RESULT IN NULLPOINTEREXCEPTION”
PH42107 PERMISSION ERROR WHEN SAVING ANY CHANGES IN ENVIRONMENT BASIC SETTINGS WITHOUT THE MANAGE APPROVAL PROCESSES PERMISSION
PH41979 ENVIRONMENT COMPARISON DISPLAYS AN EMPTY PAGE WITH ERROR “TYPEERROR:TEMPLATEPROPSHEET IS UNDEFINED”
PH41916 RESOURCE TREE NO LONGER SUPPORTS DRAGGING MULTIPLE SELECTIONS AT ONCE
PH41143 STEP CREATE COMPONENT OF THE PLUGIN URBANCODE DEPLOY COMPONENTS DOES NOT INITIALIZE ALL THE PROPERTIES
PH40705 RUNNING A REPORT USING A PREDEFINED DATE RANGE MAY EXCLUDE SOME DATA COMPARED WITH USING THE EQUIVALENT CUSTOM DATE RANGE

7.2.1.1

PH41208 MAVEN SOURCECONFIG PLUGIN V20 DOES NOT TRANSLATE SNAPSHOT VERSIONS ON AUTOMATIC IMPORT
PH41044 AN AGENT USING AN AGENT-RELAY THAT FAILS-OVER TO A COLD STANDBY SERVER URI, WILL NOT SWITCH BACK TO ANOTHER SERVER.
PH38704 UPGRADE FAILS AT APPLYING N1_6.2.3 CHANGE: 5
PH40175 UNABLE TO ACQUIRE JDBC CONNECTION WHEN USING JAVA KERBEROS IN THE JDBC AUTHENTICATION
PH39436 APPLICATION PROCESS FAILING TO SUBMIT DEPLOYMENT FOR PROPERTIES WHICH ARE NOT REQUIRED.
PH39353 OPERATIONAL COMPONENT PROCESS (NO VERSION NEEDED) SHOWS WRONG PROCESS IN PROCESS DESIGNER
PH38883 DEPLOYMENT FAILS WITH “NOTIFICATION TEMPLATE” AS “NONE” FOR THE MANUAL TASK
PH38886 WHEN INCREMENTAL SYNC IS BEING RUN, UCD IS NOT RETURNING SNAPSHOTSTATUSES CORRECTLY
PH36192 AGENTWORKERTHREAD ORG.ECLIPSE.JETTY.SECURITY.SECURITYHANDLER – ERROR WHILE LOADING AUTHENTICATORFACTORY WITH SERVICELOADER : ERROR IN AGENT RELAY LOG

7.2.1

PH40248 URBANCODE DEPLOY DEPLOYMENT HISTORY CLEANUP FAILS WITH ERROR “ORG.HIBERNATE.EXCEPTION.LOCKACQUISITIONEXCEPTION” ON MYSQL
PH39474 WORKFLOWS FAIL ON WEB AGENTS WITH THE ERROR “DATA TOO LONG FOR COLUMN ‘COMMAND_DATA'” AFTER 6.2.7 UPGRADE ON MYSQL/DB2.
PH38671 ON DB2, UPGRADE TO 7.1.2.0 FAILS WITH UNTERMINATED ‘ CHARACTER ERROR
PH36592 DRAGGING AND DROPPING MULTIPLE COMPONENTS ONTO AN AGENT IN ENV BASE RESOURCES FAILS WITH EXCEPTION
PH32165 FROM AGENT POOL, SAME AGENT IS PICKED UP FOR MULTIPLE CONCURRENT COMPONENT PROCESSES IRRESPECTIVE OF LOAD
PH31356 WHEN LDAP SYNC USER IS PART OF MORE THAN 1000 GROUPS SYNC IS FAILING
PH20463 STUCK WORKFLOWS CANNOT BE CANCELLED THROUGH THE UI
SELECTING RESOURCES TO ADD FOR TEAMS CAN HANG WHEN RENDERING ON THE ORDER OF 10000 ITEMS.

7.2.0.2

PH38774 APPLICATION TEMPLATE ENVIRONMENT GATES FAIL TO LOAD
PH38451 VIEWING STEP LOGS CAN CAUSE FILE.LISTFILES CALLS THAT ARE UNNECESSARY
PH38449 LARGE AMOUNTS OF E-MAIL NOTIFICATIONS CAUSES SLOWNESS IN THE URBANCODE DEPLOY SERVER
PH38362 SNAPSHOTS ARE NOT SORTED BY OLDEST TO NEWEST BY DEFAULT
PH38265 URBANCODE DEPLOY ENVIRONMENT GATES CANNOT BE CONFIGURED AFTER UPGRADE TO 7.1.2.0.IFIX01
PH34354 THE “OUTPUT LOG” POPUP PAGE CRASHES THE BROWSER TAB
PH31494 INCORRECT LOGIN ATTEMPT INVALIDATES EXISTING LOGGED-IN USER’S ‘REMEMBER ME’ SESSION
PI87112 SLOWNESS WHEN RETRIEVING VERSION INFORMATION

7.2.0.1

PH38271 ENVIRONMENT NAME IS MISSING FROM DEPLOYMENT WIZARD IF THE USER DOES NOT HAVE PERMISSION TO VIEW THE ENVIRONMENT TEMPLATE
PH38063 SYNCHRONIZE WITH TEMPLATE ACTION DROP DOWN ON RESOURCE TREE PAGE IS NOT SELECTING AFTER SCROLLING
PH37129 WHOLE BINARIES CONTENT ARE PRINTED AS PART OF STACK TRACE WHEN A USER UPLOADS A BINARY FILE TO IMPORT COMPONENT TEMPLATE.
PH36759 SELECT ALL, AND FILTER BOX IS MISSING FOR ADDING MEMBERS IN ROLE CONFIGURATION.
PH36522 MANUAL TASKS WITH PROPERTY TYPE: SELECT STEP IS FAILING WITHOUT AN OPTION TO RESPOND IN 7.1.1.2
PH36257 UCD COMPONENT API ALLOWS SAVING A COMPONENT WITHOUT SETTING REQUIRED PROPERTIES FROM TEMPLATE.
PH35477 INCREMENTAL VERSION ARE DISPLAYED IN REVERSE ORDER WHEN SELECTING THE VERSION FOR DEPLOYMENT
PH35313 COMPONENT RESOURCES CREATED AFTER ADDING AGENT TO A RESOURCE TREE DO NOT INHERIT TEAMS CORRECTLY.
PH34449 PAUSE AND CANCEL BUTTONS IN APPLICATION PROCESS PAGE ARE ACTIVE EVEN FOR THE USER HAVING ONLY VIEW ACCESS.
PH29798 DOWNLOAD ARTIFACT STEP FAILS – JAVA.LANG.ILLEGALSTATEEXCEPTION: KEYSTORES WITH MULTIPLE CERTIFICATES ARE NOT SUPPORTED
PH27170 USER DROP-DOWN LIST ON DEPLOYMENT DETAIL REPORT PAGE SHOWS EMPTY FOR A USER WITH LIMITED PERMISSIONS
PH22029 CURRENT RESOURCE INVENTORY STATUS IS LOST IF DEPLOYMENT FAILS

7.2.0

PH37507 COPY TO CODESTATION IS UNCHECKED REGARDLESS OF SYSTEM SETTINGS
PH37276 WEB AGENT RUNNING WITH OPENJDK JAVA-1.8.0_252-B09 FAILS TO CONNECT TO UCD SERVER RUNNING WITH IBM JAVA 1.8.0_281
PH36751 USERS REQUIRE READ PERMISSION TO ALL COMPONENTS OF AN APPLICATION WHETHER THE DEPLOY PROCESS USES THAT COMPONENT OR NOT
PH36572 RESOURCES AGENTS PAGE DOES NOT SHOW THE LAST COLUMN ‘THREE VERTICAL DOTS’ – ACTION OPTIONS UNTIL SCROLLED DOWN
PH35795 HISTORY OF AN APPLICATION IN V7.1.1.2 SHOWS THE ERROR “NO ROW WITH THE GIVEN IDENTIFIER EXISTS” AFTER UPGRADING FROM 6.2.
PH34716 NEW ENVIRONMENT PROPERTY CREATED ON A COMPONENT TEMPLATE IS NOT RESOLVED DURING COMPONENT DEPLOYMENT
PH34641 DEPLOYMENT WIZARD REVIEW PAGE LISTS APPLICATION PROCESS AND APPROVAL PROPS BY NAME NOT LABEL.
PH30992 DELETED TYPE CAUSES INCORRECT BEHAVIOUR WITH TEAMS AND TYPES IN URBANCODE DEPLOY
PH29514 PERFORMANCE ISSUE WITH CONFIGURATION TAB ON WEB UI
PH27826 SNAPSHOT FROM ENVIRONMENT CAN BE EDITED EVEN AFTER ITS DELETION
PH16827 COMPONENT VERSION STATUSES ARE MISSING WHEN YOU IMPORT AN APPLICATION WITH A SNAPSHOT
PI96213 URBANCODE DEPLOY PROCESS HANGS AFTER REBOOT STEP IS INVOKED IN A COMPONENT PROCESS
PI86341 CANNOT LOAD LATEST VERSION OF APPLICATION PROCESS
PI43590 MISSING INFORMATION FOR OPERATIONAL COMPONENT PROCESSES IN AN APPLICATION PROCESS

7.1.2.8

PH36751 USERS REQUIRE READ PERMISSION TO ALL COMPONENTS OF AN APPLICATION WHETHER THE DEPLOY PROCESS USES THAT COMPONENT OR NOT

7.1.2.7

This release only contains security fixes which are announced through security bulletins.

7.1.2.6

This release only contains security fixes which are announced through security bulletins.

7.1.2.5

This release only contains security fixes which are announced through security bulletins.

7.1.2.4

This release only contains security fixes which are announced through security bulletins.

7.1.2.3

PH38723 JMS UPGRADE FROM 7.1.0.3 TO 7.1.2.1 FORCES JMS TO WEB UPGRADE WITH INVALID DEFAULT SERVER.URI ‘LOCALHOST’

7.1.2.2

This release only contains security fixes which are announced through security bulletins.

7.1.2.1

PH36228 Post Processing Scripts from before 7.1.2 are not be visible by anyone other than the System Admin user
PH36168 “NO SELF APPROVAL” IS NOT RESPECTED WHEN THE PROCESS IS RUN ON THE RESPECTIVE ENVIRONMENT
PH34927 THERE IS NO WAY TO DELETE AN INTERNAL APPROVAL PROCESS ONCE IT’S BEEN SAVED
PH34443 SELECT SNAPSHOT TAB NOT AVAILABLE DURING DEPLOYMENT
PH33381 DEPLOYMENT WIZARD SHOWS VERSION SELECTION PAGE WHEN ONE IS NOT NEEDED
PH32766 SNAPSHOT COMPARISON SHOULD SHOW FILE COMPARISON EVEN WITHOUT VERSIONS IN ONE SNAPSHOT
PH32274 NOTIFICATION EMAIL FROM SNAPSHOT DEPLOYMENT DISPLAYS THE WRONG COMPONENT VERSION
PH32054 TEMPLATE PROPERTIES NOT ACCESSIBLE THROUGH CLI COMMAND GETCOMPONENTPROPERTY FOR COMPONENTS CREATED OUT OF SAME TEMPLATE.
PH31285 SOURCE CONFIG PLUGIN UPGRADE FAILS DUE TO NULL SOURCE CONFIG PLUGIN PROPSHEET ON COMPONENTS
PH29896 YOU ARE ABLE TO SEE ALL OTHER TEAMS YOU ARE NOT PART WHEN ADD TEAM MEMBERS PERMISSION IS ENABLED
PH29687 ENTERING HTTPS URL IN AGENT RELAY URL (IN AGENT CONFIGURATION TEMPLATE) – ERROR IS NOT CLEAR TO USE HTTP
PH29456 LAST COMPONENT SHOWS UP IN THE ORDER OF A PREVIOUS VERSION OF THE PROCESS IN THE EXECUTION LOG WHEN USING FOREACHTAG.
PH29232 INTERMITTENT MESSAGE “PARTITION DETECTED IN WEB SOCKET AGENT COMMUNICATION.”
PH29003 RUNNING A GENERIC PROCESS ACTIVITY WITH AN AGENT POOL WITH NO ONLINE AGENTS RESULTS IN NULL POINTER EXCEPTION
PH27631 CONFIGURATION FILE TEMPLATES “RESET LATEST TO THIS VERSION” LINK DOESN’T APPEAR CLICKABLE IN UI
PH27009 DOCUMENTED DEFAULTS FOR TRUE/FALSE VALUES IN THE AGENT INST PROPS FILE ARE NOT ALWAYS HONORED DURING SILENT INSTALLATION.
PH26904 APPLICATION EXPORT WITH SNAPSHOTS FAILS WITH ERROR CODE 500
PH25996 SCHEDULED BUT CANCELED LATER DEPLOYMENTS ARE SHOWING STATUS AS PENDING INSTEAD OF CANCELED
PH25818 MEMBERS OF SYSTEM TEAM ARE RECEIVING MAIL NOTIFICATIONS CREATED BY MANUAL TASK
PH23651 WHEN DISABLING CASE SENSITIVE OPTION IN THE FILE UTILS PLUGIN THE CREATE ZIP STEP IS STILL CASE SENSITIVE FOR THE BASE DIRECTORY
PH19975 AN ADDITIONAL INDEX ON THE VC_COMMIT TABLE TO IMPROVE OVERALL URBANCODE DEPLOY PERFORMANCE
PH10164 LEADING SPACES IN COMPONENT PROCESS WORKING DIRECTORY PROPERTIES ARE NOT TRIMMED

7.1.2.0.ifix01

This release replaces the IBM UrbanCode Deploy version 7.1.2 and includes all updates made in the 7.1.2 release.

PH34622 IN REQUEST JSON OF SAVE CONDITIONS ON ENVIRONMENT GATE HAS CHANGED FROM CONDITIONS TO GATE IN 7.1.1.0 AND LATER RELEASES
PH34016 REQUESTING APPLICATION PROCESS VIA REST ENDPOINT RESPONDS WITH HTTP 405
PH33903 WHEN TO RUN ON IBM JAVA, AGENTS ONLY ENABLE TLSV1
PH33497 JMS AGENTS CONFIGURED USING MUTUAL AUTHENTICATION CAN NOT BE CONVERTED TO WEB AGENTS
PH33328 SELECT ALL DOESN’T WORK ANYWHERE (RESOURCE TREE & NON RESOURCE TREE)
PH33071 WHEN CLICKING “DOWNLOAD ALL LOGS” ON CANCELLED PROCESS REQUEST, 500 ERROR OCCUR
PH33018 Secure Properties throws error when updating component configuration from UI.
PH32476 “SET X PROPERTY” STEPS FAIL DUE TO EXCEEDING MAX NUMBER OF RETRIES
PH32454 AGENTS IN CONNECTING STATE AND LICENSED CAN FILL SERVER LOGS WITH NULLPOINTEREXCEPTION
PH32242 ADD TEAM DROPDOWN FILTER NOT FILTERING RESOURCES BY NAME.
PH31588 AFTER UPGRADE FROM BEFORE 7.0.1.0, SERVER.XML DOES NOT LOAD A LOG NOISE SUPPRESSING CUSTOM WEBAPP CLASS LOADER
PH31534 UCDEXCEPTIONMAPPER IS CAUSING EXCESSIVE ERROR LOGGING AFTER UPGRADE TO 7.0.5.0.IFIX01
PH30474 SUCCESS MESSAGE MISSING WHILE INSTALLING UCD AGENT
PH30235 CODESTATION PAGE SHOWS DELETED COMPONENTS ENTRIES
PH29936 UNABLE TO IMPORT COMPONENT VERSIONS THROUGH API
PH29795 USER IS NOT ABLE TO SAVE SYSTEM SETTINGS WITHOUT PRIVILEGE “MANAGE MAINTENANCE MODE”
PH29672 UNABLE TO CHANGE FROM THE DEFAULT VALUE FOR “AGENT EXECUTE PERMISSION REQUIRED” UPGRADE PROMPT.
PH29584 S3 ERRORS AFTER UPGRADING AN INSTANCE TO 7.0.5.3
PH28928 BATCH EDIT FOR SPECIFIC COMPONENT UNDER COMPONENT ENVIRONMENT PROPERTIES IS MISSING
PH28579 TEAMS AND TYPES ARE NOT SHOWING CORRECTLY ON A BASE RESOURCE WHEN APPLICATION IS CREATED FROM THE RESOURCE TEMPLATE
PH28456 UPGRADING TO 7.1.0.1.IFIX01 THROWS “UNTERMINATED ‘ CHARACTER?”ERROR DUE TO INCORRECT AMOUNT OF SINGLE QUOTES
PH28268 PROCESS STEP FAILING AFTER UPGRADE WITH CLASSCASTEXCEPTION
PH28218 ‘AGENT CONFIGURATION TEMPLATE’ HELP / INFO FOR THE ‘SERVER URLS’AND ‘RELAY URLS’ SHOWS INFORMATION NOT RELATED TO THOSE FIELDS.
PH28215 UNABLE REMOVE SELECTED COMPONENT FROM COMPONENT ENVIRONMENT PROPERTIES SELECTOR
IT33537 UNEXPECTED INTERNAL ERROR 172 RUNNING MERGE STATEMENT USING SUBQUERIES
PH27018 UPGRADING WINDOWS AGENTS FROM A LINUX SERVER CHANGES THE AGENT JAVA_HOME FORMAT FROM WINDOWS TO LINUX
PH25932 RUN OPERATIONAL PROCESS FOR MULTIPLE COMPONENTS PROCESS FAILS TO RUN
PH01206 SAVING UNCHANGED PROPERTIES IN BATCH EDIT MODE OVERWRITES TEMPLATE PROPERTIES
PI65492 CREATE ENVIRONMENT DIALOG DOES NOT SHOW ANY BLUEPRINTS WHEN BLUE PRINT DESIGNER’S BLUEPRINT NAMES CONTAIN NON-LATIN CHARACTERS

7.1.2

This release is replaced with version 7.1.2.0.ifix01. Version 7.1.2.0.ifix01 contains all updates added in version 7.1.2. Version 7.1.2 has been removed and not available to download. If you have installed version 7.1.2, install 7.1.2.0.ifix01 to prevent potential problems.

7.1.1.2

PH33326 FILTERING AND SORTING OF ITEMS DOES NOT WORK ON TREE TABLES
PH33330 DELETING SELECTED ITEM GENERATES AN ERROR AND PAGE IS NOTDISPLAYED CORRECTLY
PH33328 SELECT ALL DOESN’T WORK ANYWHERE (RESOURCE TREE & NON RESOURCETREE)
PH31183 PASSWORD VALIDATION ERROR FOR SSO LOGIN IN CREATE USER API RESTCALL
PH31034 RACE CONDITION IN SNAPSHOT VERSION SELECTION WHEN ADDING LATESTAVAILABLE TO SNAPSHOT
PH30855 VERSION LOADING CAUSES LOCK CONTENTION FOR SECURERANDOM.
PH30717 When a manual task has a property, clicking cancelmultiple times , makes the property value to disappear
PH30052 SELECT PROPERTIES WITH MANY VALUES DO NOT SCROLL
PH27494 AFTER RUNNING THE STOP COMMAND ON THE URBANCODE DEPLOY SERVER,THE SERVER KEEPS RUNNING, BUT THE UI WILL BE DOWN
PH26556 SNAPSHOT SELECTION HAS LATENCY OF SEVERAL MINUTES
PH20341 LOADING APPLICATION SECURITY REPORT FAILS AND PRODUCESNULLPOINTEREXCEPTION IN SERVER LOGS
RFE included in 7.1.1.2
138972 IMPROVEMENT ADDED TO THE URBANCODE DEPLOY REPLACE TOKENS PLUG-IN

7.1.1.1

PH30713 WHEN STARTING UCD SERVER INSTALLED ON LINUX ON Z ENCOUNTERINGNULLPOINTEREXCEPTION
PH30432 AUTOMATIONPLUGINMIGRATORLOOKUP HOLDS LOCK FOR TOO LONG
PH30152 PERFORMANCE DEGRADATION DUE TO LOCK CONTENTION WITHUCDWEBAPPCLASSLOADER
PH30032 ENVIRONMENT INVENTORY DISPLAYS WRONG MESSAGE ON SEARCHING ASPECIFIC COMPONENT THAT DOES NOT EXIST.
PH28700 POST UPGRADE ISSUE – EVEN THOUGH USERS HAVE THEIR TEAMS IN PREFERENCES, ITS SHOWING ALL THE TEAMS WHILE INSTALLING THE AGENTS
PH28387 S3 MIGRATOR DOES NOT WORK WITH USER AND PASSWORD ON COMMAND LINE
PH27652 UNABLE TO OPEN WORK ITEMS TAB DUE TO ERROR.
PH27441 AGENT CONFIGURATION TEMPLATES CANNOT BE EDITED.
PH23187 REST CALL TO GET INFORMATION ABOUT ALL ENVIRONMENTS IN ANAPPLICATION IS MISSING “CONDITIONS”
PH20834 ENVIRONMENT TEMPLATE NOT APPLYING ENVIRONMENT “TYPE” WHENCREATED DIRECTLY FROM “CREATE ENVIRONMENT” DIALOGUE
PH20267 WHEN SUBMITTING APPLICATION PROCESS REQUESTS THROUGH THE API, PROCESS PROPERTIES WILL NOT BE VALIDATED AGAINST ‘SELECT’ OPTIONS
PI99188 CANNOT CREATE SNAPSHOT FROM CLI USING COMPONENT ID

7.1.1.0.ifix01

This release replaces the IBM UrbanCode Deploy version 7.1.1 and includes all updates made in the 7.1.1 release, and the following fix:

PH31361 COMPONENT LIST WILL NOT LOAD IF A COMPONENT THAT WOULD SHOW UPON THE TABLE IS CURRENTLY IMPORTING A VERSION.

7.1.1

This release is replaced with version 7.1.1.0.ifix01. Version 7.1.1.0.ifix01 contains all updates added in version 7.1.1. Version 7.1.1 has been removed and not available to download. If you have installed version 7.1.1, install 7.1.1.0.ifix01 to prevent potential problems.

PH29644 AUTH TOKENS ARE NOT ACCEPTED FOR REST METHODS WITH DUPLICATE QUERY PARAMETERS.
PH28841 SNAPSHOT NOT DEPLOYING CORRECTLY WHEN APPLICATION VERSION PRESET IS SPECIFIED
PH27920 UCD SERVER INCORRECTLY SHOWS UNLICENSED DESPITE THE LICENSE SERVER HOSTING AN ‘IBMUCD_SS_AGENT_Z’ LICENSE
PH26573 THE DATABASE PASSWORD IS VISIBLE ON CONSOLE DURING UCD INSTALLATION AND MIGRATING DB FROM DERBY TO OTHER DATABASES.
PH24278 FROM AN APPLICATION PROCESS, A RUN COMPONENT PROCESS’S IGNORE FAILURE PROPERTY MAY DISPLAY UNCHECKED EVEN WHEN CHECKED
PH20874 MAINFRAME (ZOS) AGENT IN DIFFERENT TIMEZONE THAN SERVER INCORRECTLY REPORTS LASTMODIFIED TIMESTAMP OF RESOURCES

7.1.0.3.ifix01

This release replaces the IBM UrbanCode Deploy version 7.1.0.3 and includes all updates made in the 7.1.0.3 release, and the following fixes:

PH33331 MOVING RESOURCES VIA DRAG-AND-DROP TO NEW RESOURCE GROUPS CAUSESAN ERROR IN THE UI
PH33328 SELECT ALL DOESN’T WORK ANYWHERE (RESOURCE TREE & NON RESOURCETREE)
PH33326 FILTERING AND SORTING OF ITEMS DOES NOT WORK ON TREE TABLES
PH33330 DELETING SELECTED ITEM GENERATES AN ERROR AND PAGE IS NOTDISPLAYED CORRECTLY

7.1.0.3

This release is replaced with version 7.1.0.3.ifix01. Version 7.1.0.3.ifix01 contains all updates added in version 7.1.0.3. Version 7.1.0.3 has been removed and not available to download. If you have installed version 7.1.0.3, install 7.1.0.3.ifix01 to prevent potential problems.

PH28870 “LATEST AT EXECUTION TIME” AND OTHER RESOLVABLE VERSIONSELECTIONS ARE IGNORED BY DEPLOYMENT
PH19668 UDCLIENT’S CREATEENVIRONMENTFROMTEMPLATE ALLOWS YOU TO IGNOREREQUIRED PROPERTIES DEFINED IN THE ENVIRONMENT TEMPLATE
RFEs included in 7.1.0.3
  • Approval notifications should contain the versions that are being deployed
  • CLI to provide Generic Process Request History
  • CLI to remove user or group from team
  • Add CLI endpoint to update the environment with values of properties inherited from the environment template
  • Add API and CLI to perform Update Users of LDAP realm in uDeploy
  • Set exempt processes on environment through CLI
  • CLI to pause and resume deployments

7.1.0.2

PH26316 URBANCODE DEPLOY WEB AGENT INTERMITTENTLY FAILS TO CONNECT TO SERVER OR RELAY
PH25736 ENVIRONMENT DOES NOT INHERIT “Days to Retain ApplicationSnapshots” VALUE FROM ENVIRONMENT TEMPLATE
PI98487 CUSTOM DEPLOYMENT COUNT REPORT DATA MAY SHIFT BY 1 DAY IF THE COMPUTER TIME ZONE OF A REQUESTER IS BEHIND THE SERVER’S TIME ZONE
PI90067 ‘INSTALL AGENT WITH SSH’ STEP FAILS WITH ‘NOT ALL AGENTS ATTAINED ONLINE STATUS BEFORE TIMEOUT.’ WHEN AGENT BEHIND RELAY
PI89874 NO INDICATION OF AFFECTED PROCESS DURING EXPORT FAILURE
RFE included in 7.1.0.2
  • Added a CLI endpoint to delete an application and a separate endpoint to delete a component.

7.1.0.1.ifix01

This release replaces the IBM UrbanCode Deploy version 7.1.0.1 release. It includes all updates made in the 7.1.0.1 release.

PH27636 FAILURE DUE TO FILE NOT FOUND IN HFS DEPLOYMENT DUE TO INCORRECT ANT.UNTAR.
PH26202 URBANCODE DEPLOY AGENT UPGRADE FAILS WHEN RUNNING INTERACTIVELY
PH25098 CUSTOM DEPLOYMENT REPORT FAILS TO DOWNLOAD
PH24892 LOCKED SNAPSHOTS NOT MARKED AS SUCH IN APPLICATION HISTORY TAB
PH24846 AGENTCOMM.KEYSTORE.PASSWORD IS NOT GETTING ENCRYPTED FOR WEBRELAY.
PH24845 WEB AGENT-RELAY IS NOT STARTING WHEN AGENTRELAY.KEYSTORE IS MODIFIED.
PH24464 WHEN EDITING MANUAL TASK STEP PROPERTIES,EXISTING VALUE DOES NOT GET REMOVED FOR THE PROPERTY “WHO CAN APPROVE THIS TASK”
PH24052 DB2 FOR Z\OS 7.0.2 UPGRADE STEP 8 FAILS DUE TO PENDING REORG GENERATED BY STEP 7
PH23570 TEAMS ARE NOT COPIED DURING COPY OPERATION OF RESOURCES UNDER RESOURCE TEMPLATE
PH21225 When running frequent version imports for many components the number of log files retained will cause disk space to fill up
PH20251 INSTALL MULTIPLE COMPONENTS STEP DOES NOT RESPECT MAXIMUM NUMBER OF CONCURRENT COMPONENTS OR PROCESSES SETTINGS
PH19714 PROPERTY DEFINITION TYPE SELECTOR SHOULD BE DISABLED FOR EXISTING PROPDEFS BECAUSE CHANGING TYPE IS NOT ALLOWED WHEN EDITING
PH19527 COMPONENT ENVIRONMENT PROPERTIES LOST HELPFUL STYLING IN UI THAT CREATES DISTINCTION BETWEEN PROPERTY AND COMPONENT NAMES.
PH13190 UNABLE TO CUSTOMIZE DEPLOYMENT DETAILS REPORT
PI98792 INCONSISTENCY BETWEEN WARNING GIVEN TO THE USER AND ACTUAL FUNCTIONALITY ON SNAPSHOT COMPONENT VERSION CONFIGURATION TAB
PI96919 MISLEADING HTTP RESPONSE FOR REST API
PI95167 NO MATCHING LOCK EVENT TO UNLOCK EVENT IN THE AUDIT LOG
PI86931 CANCELING DEPLOYMENTS RESULT IN UP-SHIFTING QUANTITY INDICATOR IN THE PROGRESS OF THE APPLICATION PROCESS REQUEST PAGE
PI61809 YOU MAY BECOME UNABLE TO DELETE A RESOURCE TEMPLATE
PI52046 LONG ENVIRONMENT PROPERTY VALUES CAUSE ERRORS WHEN RUNNING “CREATE ENVIRONMENT PROPERTY” STEP

7.1.0.1

This release is replaced with version 7.1.0.1.ifix01. Version 7.1.0.1.ifix01 contains all updates added in version 7.1.0.1. Version 7.1.0.1 has been removed and not available to download. If you have installed version 7.1.0.1, install 7.1.0.1.ifix01 to prevent potential problems.

7.1.0

PH25819 WHEN USING JAVA 11 NOTIFICATION EMAILS ARE NOT SENT
PH24868 EDITING CONFIGURATION ON AGENT RESOURCES FROM A NON-ADMIN ACCOUNT FAILS WITH THE ERROR ‘TX IS NOT ACTIVE’
PH24747 MERGING INCREMENTAL ZOS COMPONENT VERSIONS FAILS WITH XMLSTREAMEXCEPTION
PH24083 BINARY CONFIG ZOS AGENTS FAIL TO RESTART AFTER THE UPGRADE
PH23051 “INHERIT TEAMS FROM PARENT” ON RESOURCE TREE KEEPS TEAMS EDITABLE
PH22980 When creating a component, the DIALOG DOES NOT ALLOW USERS TO ASSIGN THE CORRECT TEAMS IF CREATING FROM A TEMPLATE
PH22889 Removing entry in Cluster Members Configuration required restart of other servers in cluster
PH22782 TOPOLOGY SYNC DOES NOT EXCLUDE GHOSTED AGENTS
PH21970 COMPONENT DEPLOYMENT HISTORY CLEANUP RECORDS END DATE NEVER SET
PH21828 COMPONENT PROCESS PROPERTY’S SECURE VALUES ARE OUTPUT AS ***** IN PLACE OF TEXT WHEN RUN VIA APP => COMPONENT => RUN PROCESS
PH21351 VALIDATION FOR COMPONENT PROCESS NAME IS FAILING DUE TO TAB CHARACTER.
PH20030 UNABLE TO ADD THE VERSION STATUS WITH “/” IN THE NAME TO A COMPONENT VERSION
PH19492 LARGE NUMBER OF APPLICATION TEMPLATE VERSIONS MAKES LOADING THE COMBOBOX VERY SLOW TO SELECT VERSION FOR EDITING APPLICATION
PH19472 UPGRADE OF UCD FAILS IF THE ‘MANAGE PROPERTIES’ PERMISSION ALREADY EXISTS ON THE ‘UC AUTO DISCOVERY’ ROLE
PH19280 COMPONENT PROCESS SAVED WITH PROCESS TYPE THAT REQUIRES INVENTORY STATUS IS ABLE TO BE SAVED WITHOUT INVENTORY STATUS
PH19199 ARTIFACT UPLOAD FAILS DUE TO FAILURE TO DELETE TEMPORARY STAGING DIRECTORY
PH17403 URBANCODE DEPLOY SNAPSHOT ADD COMPONENT VERSION FILTERING NOT WORKING.
PH17107 UCD database is growing quickly with JMS Agent records in the VC_PERSISTENT_RECORD TABLE
PH16457 “INSTALL TEMPLATE” OF UCD CONFIGURATION MANAGEMENT PLUGIN GIVES NULLPOINTER WHEN NO CONFIG TEMPLATE IS PRESENT
PH08897 RUN PROCESS AFTER A VERSION IS CREATED WILL RUN THE PROCESS AS ADMIN AND CANNOT BE RESTRICTED
PH01547 LONG VERSION NAMES CAN NOT BE DELETED FROM THE COMPONENT VERSIONS SELECTION
PH91434 PH91434 UCD WINDOWS SERVICE START FAILS: ‘…JAVA.LANG.UNSATISFIEDLINKERROR: RCL_IBMRATL (NOT FOUND IN JAVA.LIBRARY.PATH)’
PH163236 LAUNCHING PROCESSES SLOW ON DB2
PH157054 COMPONENT OR APPLICATION PROCESS DESIGN PRINT PREVIEW GIVES BLANK TAB IN BROWSER IE11

7.0.5.12

PH36751 USERS REQUIRE READ PERMISSION TO ALL COMPONENTS OF AN APPLICATION WHETHER THE DEPLOY PROCESS USES THAT COMPONENT OR NOT

7.0.5.11

This release only contains security fixes which are announced through security bulletins.

7.0.5.10

This release only contains security fixes which are announced through security bulletins.

7.0.5.9

This release only contains security fixes which are announced through security bulletins.

7.0.5.8

This release only contains security fixes which are announced through security bulletins.

7.0.5.7

This release has been replaced with version 7.0.5.8. Version 7.0.5.8 contains all updates added in version 7.0.5.7.

7.0.5.6

This release only contains security fixes which are announced through security bulletins.

7.0.5.5

This release only contains security fixes which are announced through security bulletins.

7.0.5.4

This release only contains security fixes which are announced through security bulletins.

7.0.5.3.ifix01

This release replaces the IBM UrbanCode Deploy version 7.5.0.3 release. It includes all updates made in the 7.0.5.3 release.

7.0.5.3

This release is replaced with version 7.0.5.3.ifix01. Version 7.0.5.3.ifix01 contains all updates added in version 7.0.5.3. Version 7.0.5.3 has been removed and not available to download. If you have installed version 7.0.5.3, install this 7.0.5.3.ifix01 to prevent potential problems.

7.0.5.2

PH20028 IMPORTING COMPONENT TEMPLATE WITH TAGS AS AN UPGRADE FAILS WITH CONSTRAINT VIOLATION
PH18680 SLOW START OF DEPLOYMENT PROCESSES USING MANY COMPONENT TAGS
PH18402 USER WITHOUT “MANAGE APPROVAL PROCESSES” PERMISSION CAN EXEMPT ENVIRONMENTS FROM NEEDING AN APPROVAL BEFORE RUNNING DEPLOYMENTS
PH15748 VC CACHING RAISES SECURITY EXCEPTION WHEN RESTORING FROM CACHE
PH18758 UNLICENSED AUTHORIZED AGENTS NOT BEING REFRESHED AFTER UPDATING SERVER LICENSE CONNECTION

7.0.5.1

PH21733 WHEN DOWNLOADING CACHED CODESTATION LARGE ARTIFACTS ON A RELAY,ERROR “ARTIFACT SET DOWNLOAD FAILED WITH AN IOEXCEPTION”
PH21708 UCD SERVER LOGS FLOODED BY TOMCAT NPE ERRORS
PH18989 Using a URL for an HTTPSelect that does not produce the requiredtype results in ‘An problem occurred retrieving data from url’
PH18547 AFTER UPGRADE TO 7.0.3.0 CANNOT INSTALL AGENTS USING WINRS
PH18215 Large NUMBER OF DB CALLS WHILE ACCESSING COMPONENT TEMPLATES
PH09553 EXPORT APPLICATION FAILS WITH NULL POINTER EXCEPTION ON MISSING USER ROLE

7.0.5.0.ifix01

PH21733 RELAY CODESTATION CACHE CANNOT SERVE LARGE ARTIFACTS
PH21708 UCD SERVER LOGS FLOODED BY TOMCAT NPE ERRORS

7.0.5

This release is replaced with version 7.0.5.0.ifix01. Version 7.0.5.0.ifix01 contains all updates added in version 7.0.5. Version 7.0.5 has been removed and not available to download. If you have installed version 7.0.5, install this 7.0.5.0.ifix01 to prevent potential problems.

PH18988 DOUBLY RECURSIVE PROPERTIES CAN REACH A VERY LARGE NUMBER OF CHARACTERS AND RESULT IN HIGH MEMORY CONSUMPTION.
PH18495 AFTER UPGRADING URBANCODE DEPLOY, DATABASE RESOURCE CONSUMPTION INCREASED.
PH18308 PERFORMANCE ISSUE ON THE INV_ENV_PROP_INVENTORY TABLE
PH17929 INSTALLING AN UCD AGENT REMOTELY USING THE WEB UI FAILS WITH:UNABLE TO REACH A SETTLEMENT
PH16527 LOGGING USERS OUT DESPITE CHECKING “KEEP ME LOGGED IN”
PH16395 WHEN RUNNING A DEPLOYMENT, UCR ERRORS AND THE UCD APPLICATION PROCESS HISTORY SHOWS AN ERROR: CANNOT INSERT DUPLICATE KEY
PH16324 WHEN TRYING TO CREATE AN ENVIRONMENT WITH REQUIRED PROPERTIES VIA THE REST API, YOU GET ‘ERROR PROCESSING COMMAND’
PH06785 COPYING AND PASTING OF AGENT PROTOTYPE IS ALLOWED IN SAME RESOURCE GROUP BUT SHOULD NOT BE ALLOWED
PI90532 IT IS NOT POSSIBLE TO DISTINGUISH COMPONENT-RESOURCES IN SNAPSHOT CONFIGURATIONS

7.0.4.3

This release only contains security fixes that are announced via security bulletins.

7.0.4.2

PH17700 ON LAPTOPS WITH SMALL MONITORS, OR UNDER HIGH ZOOM, THE ‘OK’ BUTTON IS MISSING WHEN SELECTING VERSIONS TO DEPLOY.
PH17506 CHOOSE-VERSION WINDOW WHILE DEPLOYING APPLICATION APPEARS TRUNCATED POST UPGRADE TO 7.0.3.1 FROM 6.2.7.2.
PH17276 WHEN USING LDAP for authentication, the GROUP REALM’S CONNECTION DETAILS are IGNORED
PH17009 UNABLE TO ADD TEAMS TO A GENERIC PROCESS VIA THE REST CALL
PH16897 UNVERSIONED COMPONENT REQUESTS DO NOT SHOW ON THE DEPLOYMENT DETAIL REPORT.
PH16717 WHEN BASE RESOURCES ARE ADDED TO ENVIRONMENT TWICE DUPLICATE ENTRIES ARE INSERTED IN THE DATABASE
PH16539 HISTORY CLEANUP DOES NOT LOG COMPLETION MESSAGES
PH16257 UCD CREATE APPLICATION WIZARD UI ISSUE
PH16019 INTEGRITY CONSTRAINT VIOLATION WHEN CLEANING UP GHOSTED ENVIRONMENT RECORDS
PH15826 MAX SIMULTANEOUS PROCESSES FEATURE NOT WORKING WITH APPLICATION TEMPLATES
PH15133 COMPONENT VERSIONS REVERSED AFTER IMPORT/EXPORT FROM ONE APPLICATION SNAPSHOT TO ANOTHER APPLICATION.
PH15130 SNAPSHOT EXPORT/IMPORT ISSUE INTO THE SAME SERVER, ARTIFACTS DISAPPEAR AFTER IMPORTING FROM ONE APPLICATION TO ANOTHER.
PH14948 WHEN PROPERTY FILES ARE RENAMED UCD WILL NOT START.
PH13513 UCD SERVER STARTUP FAILS WITH DRAFTPROCESSCREATIONUPGRADER ERROR
PH13242 LARGE TABLE DS_LICENSE_LOG_ENTRY CAUSES PERFORMANCE ISSUES
PH12776 FLOATING LICENSES OCCASIONALLY NOT RELEASED IN HA ENVIRONMENTS
PH11564 COMPLIANCE UNCHANGED IF INSTALLATION AND ROLLBACK BOTH FAIL
PI99408 PLUGIN.XML NOT VALIDATED AGAINST SCHEMA WHEN PLUGIN LOADED
PI97459 REOCCURRING ERROR – JAVA.IO.IOEXCEPTION: UNABLE TO UNWRAP DATA, INVALID STATUS [CLOSED]
PI84390 RESOURCE PROPERTIES DEFINED IN THE RESOURCE TEMPLATE ARE NOT IMPORTED TO RESOURCES CREATED USING THE TEMPLATE.
PI82637 AUTO-COMPLETE FOR PROPERTIES NO LONGER WORKS FOR THE SHELL SCRIPT

7.0.4.1

PH17277 WITH MULTIPLE LDAP GROUP REALMS MAPPED TO AN USER REALM LOGIN CAN FAIL IF THE USER IS ONLY IN ONE LDAP GROUP REALM
PH14523 RECORDS FROM INV_RESOURCE_CONFIG_INVENTORY, INV_RESOURCE_INVENTORY ARE NOT GETTING DELETED AS PART OF DEPLOYMENT HISTORY CLEANUP
PH16696 LOW SCREEN RESOLUTION HIGH BROWSER ZOOM, AND SCROLLING DOWN A LIST, WILL MAKE THE MENU HEADER POP UP OVER THE LISTED OBJECTS
PH16054 URBANCODE DEPLOY WEB AGENTS ARE NOT RESOLVING THE AGENT RESOURCE WORKING DIRECTORY WITHOUT / AT THE END OF PATH
PH16030 UC AUTO DISCOVER ROLE IS NOT GIVEN ‘MANAGE PROPERTIES’ PERMISSION TO RESOURCES ON UPGRADE
PH15905 SILENT AGENT INSTALLATION FAILING WHEN AGENT.SERVICE.AUTOSTART IS DEFINED AS TRUE/FALSE INSTEAD OF YES/NO
PH15806 CANCELED PROCESSES DO NOT REMOVE ALL TEMPORARY FILES FROM THE AGENT TEMP DIRECTORY
PH15666 ACTIVE CHECK BOX IS ALWAYS CHECKED IN THE EDIT WINDOW FOR CLUSTER MEMBERS UNDER THE NETWORK TAB
PH15581 DB2 FOR Z\OS THE ALTER TABLE STATEMENT CANNOT DROP MULTIPLE COLUMNS. SEPARATE ALTER TABLE STEPS ARE REQUIRED.
PH15288 DEPLOYMENT HISTORY CLEANUP DOES NOT CLEAN UP COMPONENT PROCESSES RUN OUTSIDE OF AN APPLICATION PROCESS
PH14934 OPTIONAL PROPERTIES SHOULD NOT BE REQUIRED BY REST ENDPOINT FOR IMPORTING NEW COMPONENT VERSIONS
PH14713 NULL POINTER WHEN IMPORTING APPLICATION WITH SNAPSHOTS
PH14623 DEFAULT TEAMS SET IN USER PREFERENCES DO NOT WORK FOR GENERICPROCESSES
PH14656 NULL POINTER EXCEPTION ON PROCESS STEP FOR OPERATIONAL PROCESS WITH “RUN IF COMPONENTS CHANGE” CHECKED
PH14592 RESOURCESYNCHSERVICE CACHE TOO MANY PROPERTYSHEETGROUPS INTO MEMORY WHICH CAN DEGRADE PERFORMANCE ON RESOURCE TREE
PH14011 LICENSE RELATED NULL POINTER EXCEPTIONS FILLING UP LOG FILE
PH12994 COMPONENT CREATED FROM COMPONENT TEMPLATE CAN SHOW ERRONEOUS RECORDS FOR TEMPLATE VERSION
PH12904 AFTER UPGRADING TO 7.0.2.3, AGENT INSTALLATION VIA SSH FAILS WITH POPUP ALERT “ID TO LOAD IS REQUIRED FOR LOADING”
PH12857 NO NOTIFICATION ABOUT TO CREATE AN OBJECT WITHOUT TEAM MAPPED WHEN IT SHOULD BE ACTUALLY MAPPED.
PH11938 CHANGES TO ENVIRONMENT PROPERTIES DEFINED BY A COMPONENT ARE NOT PROPAGATED CORRECTLY TO ENVIRONMENT
PI90702 DATE INPUT FIELD NOT WORKING FOR IE11
PI89453 WHEN IMPORTING A USER FROM LDAP, THE USER IS CREATED IN THE DATABASE BEFORE ANY LDAP QUERY ERROR IS DETECTED.

7.0.4.0.ifix02

7.0.4.0 has been been ifixed again. The following issues are fixed in 7.0.4.0.ifix02:

PH18861 NEW INSTALLATIONS OF UCD 7.0.4.0 USING MYSQL OR MARIADB WILL USE WRONG LOB SIZE TYPES.
PH18917 DEPLOYMENTS FAIL WHEN RUNNING ON 7.0.3.3 AGENT RUNNING AS WINDOWS SERVICE
PH18887 SERVER CANNOT COMMUNICATE WITH AGENT CONNECTED TO DIFFERENT SERVER IN HA ENVIRONMENT.

7.0.4.0.ifix01

7.0.4.0 has been replaced by 7.0.4.0.ifix01 in order to provide a fixes for the following issues:

PH18233 7.0.3.3 AGENTS RUNNING AS A WINDOWS SERVICE DO NOT START AFTER THE WINDOWS SERVICE STOPPED
PH18873 BUZTOOL IN MAINFRAME FAILS WHEN A PROPERTY NEEDS TO BE SET FOR A UCD COMPONENT VERSION

7.0.4

This release is replaced with version 7.0.4.0.ifix02. Version 7.0.4.0.ifix02 contains all updates added in version 7.0.4. Version 7.0.4 has been removed and not available to download. If you have installed version 7.0.4, install this 7.0.4.0.ifix02 to prevent potential problems.

PI61809 YOU MAY BECOME UNABLE TO DELETE A RESOURCE TEMPLATE THAT INCLUDES AN AGENT
PH15245 WEB AGENTS FAILING WITH OUT OF MEMORY EXCEPTION
PH14186 COMPONENT ENVIRONMENT PROPERTIES IN AN APPLICATION ARE NOT SHOWN IF A USER DOES NOT HAVE READ PERMISSION TO ALL COMPONENTS
PH11266 UCD SENDS AGENT 6.1.0 ILMT SIGNATURE FILE (SWIDTAG) INSTEAD OF A TAG BASED ON THE AGENT VERSION
PH18327 PROCESSES ARE NOT UPGRADED WHEN PLUGINS ARE UPGRADED
PH09862 AUTOMATION PLUGIN MIGRATION DOES NOT UPGRADE COMPONENT PROCESSES AFTER UPGRADING TO 7.0.2.0

7.0.3.4

This release only contains security fixes that are announced via security bulletins.

7.0.3.3.ifix02

7.0.3.3 has been been ifixed again. The following issues are fixed in 7.0.3.3.ifix02:

PH18917 DEPLOYMENTS FAIL WHEN RUNNING ON 7.0.3.3 AGENT RUNNING AS WINDOWS SERVICE
PH18887 SERVER CANNOT COMMUNICATE WITH AGENT CONNECTED TO DIFFERENT SERVER IN HA ENVIRONMENT.

7.0.3.3.ifix01

7.0.3.3 has been replaced by 7.0.3.3.ifix01 in order to provide a fix for the following issue:

PH18233 7.0.3.3 AGENTS RUNNING AS A WINDOWS SERVICE DO NOT START AFTER THE WINDOWS SERVICE STOPPED

7.0.3.3

7.0.3.3 has been replaced by 7.0.3.3.ifix02 as of October 20th, 2019. All customers currently on 7.0.3.3 are recommended to upgrade to 7.0.3.3.ifix02.

PH13982 When selecting any sub-resource on a resource tree, the Resource Tree collapses to the top level resource
PH13898 RESOURCE SYNC SERVICE NOT SYNCHRONIZED ACROSS HA INSTANCES
PH13751 WHEN UPGRADING FROM UCD V 6.2.7 TO VERSION 7.0.1 UNKNOWN UCDAGENTLICENSETYPE: AGENT_PVU
PH13734 COPY OF COMPONENT IS NOT COPYING CONFIGURATION TEMPLATES OF THE COMPONENT
PH13398 CLI API GETSNAPSHOTVERSIONS RETURNS DIFFERENT JSON OBJECT IN V7.0.2.2 THAN WITH V6.2.5
PH13078 HTTP ENCODING OF WHITESPACE CHARACTER DURING UCD STARTUP RESULTS IN FILENOTFOUNDEXCEPTION
PH12905 DELETING A COPIED STEP FROM CLIPBOARD FAILS IN LANGUAGES OTHER THAN ENGLISH
PH10787 IF ENVIRONMENTS ARE PROVISIONED FROM BPD ,WHEN DEPLOYMENT IS CANCELLED TOKEN LICENSES ARE NOT GETTING RELEASED BY AGENTS.
PH09485 USERS WITHOUT COMPONENT TEMPLATE READ PERMISSION CANNOT RUN COMPONENT PROCESSES FROM THE SAME TEMPLATE
PH09250 ADDING SAFE EDIT CAUSES IBM DB2 ERRORS IN UCD SERVER LOGS
PH09239 SELECT COMPONENT VERSION DIALOG NOT DISPLAYING THE WHOLE VERSION NUMBER FOR VERSIONS WITH LONG NAMES
PH06338 CANCEL APPLICATION PROCESS EXECUTION WITH “INSTALL MULTIPLE COMPONENTS” STEP , SHOULD CANCEL ALL COMPONENT PROCESSES ALSO
PH01967 ERROR MESSAGE NOT UTF-8 ON Z/OS WHEN USING IMPERSONATION
PI56142 PERFORMANCE DELAYS IN PROCESS DESIGNER WHEN MOVING THROUGH PROCESS PROPERTIES

7.0.3.2

PH12814 EACH PAGE LOAD TAKES SEVERAL (5 TO 20) SECONDS
PH12486 ERROR LOG WINDOW IS SHRUNK IN SIZE WHEN CHANGING THE ZOOM LEVEL ON THE BROWSER
PH12462 EXISTING PLUGINS FAIL TO LOAD WHEN IMPORTING AN ENVIRONMENT FROM JSON
PH12129 DELETED ENVIRONMENTS APPEAR IN UCD SECURITY REPORT WHEN DOWNLOADING CSV
PH11679 DEPLOYMENT FAILS WHILE USING FOR EACH TAG FOR AN UNRELATED OFFLINE AGENT
PH11665 TEAMS ARE NOT INHERITED AT THE CHILD RESOURCE ADDED BY COMPARE OR SYNCHRONIZE ACTION
PH11630 COMPONENT ENVIRONMENT SELECTION PROPERTIES WITH NO DEFAULT DISPLAYS THE FIRST VALUE WHEN VIEWED IN ENV COMPONENT PROPS
PH11361 COMPONENT VERSION CLEANUP IS NOT PROPERLY ORDERED
PH11030 WHEN APPLICATION TYPE IS DELETED AND RECREATED , IMPORTING APPLICATIONS WITH SAME APPLICATION TYPE NAME IS GIVING ERROR.
PH09234 DELETING COMPONENT’S ENVIRONMENT PROPERTY DEFINITION DOES NOT REVERT TO USING ITS TEMPLATE’S ENVIRONMENT PROPERTY DEFINITION
PH08798 SOURCE CONFIG PLUGIN MIGRATOR DOES NOT CHECK A COMPONENT’S COMPONENT TEMPLATE’S PROPSHEET VALUES
PI94048 USERS UNABLE TO HOVER OVER LDAP GROUPS IN PROFILE TO SEE USERS.
PI92489 AFTER SCHEDULING A PROCESS TO RUN AT 12:00AM, IT DOES NOT SHOW UP CORRECTLY ON THE CALENDAR.
PI91531 EXTRA WINDOWS SERVICE INSTALLATION FILE
PH14768 AVOID LOADING FULL AGENT INSTANCES BY OPTIMIZING DYNAMIC GROUP SYNCHRONIZATION
PH08408 COMPONENTS WITHOUT THE CORRESPONDING SOURCE CONFIG PLUGIN PROPSHEET WILL CAUSE PLUGIN UPGRADE TO FAIL WITH NPE
PH09190 SOURCE CONFIG PLUGIN MIGRATOR USES OLD PROP DEF SHEET TO VALIDATE PROPERTIES

7.0.3.1

PH13888 UPDATING ENVIRONMENT PROPERTY FOR MULTIPLE COMPONENTS USING ‘ALL COMPONENTS’ SETTING RESULTS IN WEBUI HANGING
PH11860 WAS – DEPLOY PLUGIN UPGRADE PROCESS RUNS INCREDIBLY SLOWLY
PH11791 APPLICATION PROCESS STEP LOG IS UNORDERED AFTER RUNNING A PROCESS
PH11513 ADD TEAMS COMBO BOX DOES NOT ALLOW FOR PARTIAL MATCHES, MATCHES BY CHARACTER
PH10772 LONG GROUP NAME CAUSES REST FAILURE IN CLI API RELATED TO GROUP ON DB2
PH10725 REMOVE FILTER BUTTON OVERLAPS APPLICATION FIELD ON IE11
PH10664 DELETING AN AGENT FROM A SERVER INSTALLED ON Z/LINUX
PH10616 ROLLING BACK DEPLOYMENT IN ONE ENVIRONMENT CHANGES THE COMPLIANCE STATUS OF ANOTHER ENVIRONMENT
PH08374 Running the ‘Upload Artifacts’ Step in UrbanCode Deploy 7.0.1.x fails with: java.io.IOException: Not authorized: versionID>
PH06993 IMPERSONATING WITH INVALID WORKING DIRECTORY DEFAULTS WORKING DIRECTORY TO AGENT/BIN
PH04513 LOGS ARE NOT DELETED FROM AGENT /VAR/TEMP IN CLUSTERED SCENARIO
PI80921 CALENDAR VIEW RECURRING PROCESSES ARE MISSING NAME
PH04513 LOGS ARE NOT DELETED FROM AGENT /VAR/TEMP IN CLUSTERED SCENARIO
PH11177 UNABLE TO SET PROPERTIES WHEN USING REST API TO CREATE APPLICATION FROM APP TEMPLATE

7.0.3.0.ifix01

The ifix include all noted fixes for 7.0.3 as well as the following fixes.

PH13992 TEAM SELECTOR DOES NOT DISPLAY TEAM DROPDOWN WHEN CREATING COMPONENT OR APPLICATION FROM TEMPLATE

7.0.3

7.0.3 release has been replaced by the 7.0.3.0.ifix01 release.

PH11608 WINDOWS AGENT UPGRADE TO 7.0.2.2 IS FAILING IF AGENT INSTALLATION PATH CONTAINS SPACES IN IT .
PH10460 ENVIRONMENT COLORS SELECTED IN OLDER VERSIONS DEFAULT TO CERULEAN IN VERSIONS POST 7.0.0.0
PI96562 APPLY CONFIGURATION STEP FAILS BUT, BUT THE COMPONENT CONFIGURATION INVENTORY IS STILL UPDATED
PI94893 CHECKACCESS PROGRAM IS NOT REMOVED FROM THE BIN DIRECTORY AFTER AGENT UGPRADING
PH06740 TEAM SELECTOR MAY NOT SHOW ALL TYPES FOR WHICH THE USER HAS MANAGE TEAM PERMISSION
PH06615 DELETED TYPES ARE STILL VISIBLE WHEN ASSIGNING TEAMS AND TYPES TO A UCD OBJECT
PH05675 ON ANY UCD OBJECT CONFIGURATION, USERS ARE ABLE TO ADD ALL CONFIGURATION TYPES.
PH04216 USER BELONGING TO GROUPS CAN NO LONGER ADD TEAMS TO UCD OBJECTS EVEN IF THEY HAVE MANAGE TEAM PERMISSION
PH05178 CANNOT ADD TEAM AS CUSTOM TYPE WHEN CREATING ENV TEMPLATE

7.0.2.3.ifix02

Version 7.0.2.3 is ifixed again. Version 7.0.2.3.ifix02 contains all updates made in 7.0.2.3.ifix01 and 7.0.2.3.

PH09559 DELETED TYPES ARE STILL SHOWING WHEN ASSIGNING
PH09550 NULL POINTER EXCEPTION WHEN IMPORTING APPLICATION CONTAINING“INSTALL MULTIPLE COMPONENTS” PROCESS STEP
PH09371 DEPLOYMENT TO ZOS AGENT RUNNING ON ZRDT FAIL WITH AN ERROR THATAGENT IS UNLICENSED
PH09250 ADDING SAFE EDIT CAUSES IBM DB2 ERRORS IN UCD SERVER LOGS
PH08796 ADDING BASE RESOURCES REQUIRES LENGTHY DURATIONS OF TIME
PH08115 AGENT LAST CONTACT VALUE NOT GETTING UPDATED FOR 6.2.7.2 AGENTSCONNECTED TO 7.0.1.1 SERVER
PH05419 COMPONENT PROCESS FAILS WITH “USER DOES NOT HAVE MANAGESNAPSHOTS PERMISSION”
PI97913 UCD 6.2.7 CREATE ENVIRONMENT WITH OVER 20 VARIABLES WILL TIMEOUT
PI88985 PLUGIN UPGRADE FAILS IF PLUGIN’S COMPONENT TEMPLATE HAS BEENDELETED

7.0.2.3.ifix01

This release replaces the version 7.0.2.3 release. It includes all updates made in the 7.0.2.3 release.

7.0.2.3

Version 7.0.2.3 has been removed and not available to download. If you have installed version 7.0.2.3, install 7.0.2.3.ifix02 to prevent potential problems.

7.0.2.2.ifix02

PH08481 SOURCE PLUGIN MIGRATOR INCORRECTLY VALIDATES COMPONENT TEMPLATE’S PROP VALUES
PH08079 ACCESSING ENDPOINTS WITH EXPIRED AUTH TOKEN THROWS NULL POINTER EXCEPTION/td>
PH07845 ‘ADD FROM TEMPLATE’ IGNORES THE INHERITANCE OF TEAMS
PH06637 DOCUMENTATION FOR CREATE AGENT CONFIGURATION TEMPLATE INCORRECTLY SHOWS PORT 7916 FOR RELAY URLS INSTEAD OF 20080
PH06499 WHEN SELECTION SYNCHRONIZE WITH TEMPLATE TO A RESOURCE THE “${P?:PROPID}” PROPERTY DEFINITIONS ARE REMOVED
PH06253 SYNCING RESOURCES CREATED BY AN ENVIRONMENT TEMPLATE ON RESOURCE SAVE CAN HAVE POOR PERFORMANCE
PI98738 THE ‘COMPARE ENVIRONMENT’ PROPERTY ROWS OVERLAP WITH LONG PROPERTY NAMES AND VALUES
PI96984 APPLICATION PROCESS WITH UTILITY STEP FOR EACH TAG WHEN TRIGGERED AUTOMATICALLY ON COMPONENT VERSION IMPORT WOULD ALWAYS FAIL
PI91055 GROUPING APPLICATIONS OR AGENTS ‘BY TEAM’ ONLY SHOWS TEAMS THE BUILT IN ADMIN USER IS A MEMBER OF
PI89859 DUPLICATE THREAD DUMPS AND CORE DUMPS CREATED WHEN USING IBM JRE

7.0.2.2.ifix01

This release replaces the version 7.0.2.2 release. It includes all updates made in the 7.0.2.2 release.

7.0.2.2

Version 7.0.2.2 has been removed and not available to download. If you have installed version 7.0.2.2, install 7.0.2.2.ifix02 to prevent potential problems.

7.0.2.1

PH07376 SAVING A COMPONENT TO USE TEMPLATE FAILS DUE TO DELETEDENVIRONMENT
PH06510 A SINGLE CORRUPTED ‘AGENTCONFAGENTINSTALLED.PROPERTIES’ FILECAN PREVENT MULTIPLE AGENTS FROM GOING ON-LINE
PH05582 UCD SILENT INSTALLATIONS ASK FOR JAVA_HOME PATH.
PH05562 ALLOW CHANGING THE TEMPLATE FOR AN ENVIRONMENT DURING IMPORT
PH05397 CONNECTING START TO FINISH WITHOUT ANY APPROVAL IN APPROVALPROCESS OF APPLICATION ENVIRONMENT SHOULD NOT BE ALLOWED
PH05270 ADD VERSION ACTION IS HIDDEN ON THE UI WHEN THE COMPONENT NAMEOR THE CURRENT ENVIRONMENT INVENTORY HAVE A LONG NAME.
PH05160 Running agent as service on SuSE Linux Enterprise Linux failswith “start-stop-daemon: unrecognized option ‘–chuid’”
PH04356 WORKITEMS OF GENERIC PROCESS DO NOT SHOW REQUESTER
PH03132 TAG FILTER IN RESOURCES IN ENVIRONMENT DOES NOT RETURN ANYRESULTS
PH01860 SSL CONNECTION ISSUE WITH NOTIFICATIONS
PH01262 CAN’T CHANGE TEMPLATE WHILE COPYING COMPONENT WITH TEMPLATE
PH01062 SELECT VERSION “CURRENT ENVIRONMENT INVENTORY AT EXECUTION TIME”DOES NOT GET REMOVED
PH00687 PROPERTIES SHOULD NOT BE ALLOWED TO BE NAMED “.”
PH00499 DEPLOYMENT REPORTS DO NOT LIST CANCELLED STATUS IN STATUSFILTERS
PI98384 EDITING APPLICATION PROCESS STEP DISPLAY INCORRECT NAME
PI98145 UCD FAILS TO START AFTER UPGRADE IF THERE IS CORRUPTED VC DATA
PI91440 400 ERROR ON ‘CREATE SNAPSHOT OF ENVIRONMENT’ PROCESS
PI89924 ERROR WHEN DELETING PROPERTY DEFINITION
PI87973 WITH WAS-DEPLOY PLUGIN INSTALLED ADDING AGENT RESOURCE FOR ANOFFLINE/CONNECTING AGENT RESULTS IN DISCOVERY FAILED.
PI87184 UNNEEDED STEPS FAIL IF PROPERTIES NOT RESOLVED
PI85103 BATCH EDIT MODE ALLOWS TO ENTER VALUES FOR SELECT TYPE PROPERTY
PI76025 CLI OR PLUGIN STEP ALLOW CREATION OF VERSION NAMES WITH LEADINGSPACES.
PH05397 CONNECTING START TO FINISH WITHOUT ANY APPROVAL IN APPROVAL PROCESS OF APPLICATION ENVIRONMENT SHOULD NOT BE ALLOWED
PH08955 ADDING A NOTIFICATION ENTRY RESULTS IN: RESOURCE ROLE COULD NOT BE RESTORED
RFE included in 7.0.2.1
77192 Copy Security Roles

7.0.2

PH08701 INSTALL AGENT USING “WEB” COMMUNICATION FAILS WITH ERROR JAVA.LANG.INDEXOUTOFBOUNDSEXCEPTION ON ZOS
PH07944 CIPHER SUITES SHOULD BE CONFIGURED TO USE NEW ECLIPSE JETTYUPDATE IN 7.0.1.2
PH05713 /{ROLE}/ACTIONMAPPINGS “GET” REST ENDPOINT IS SHOWINGALSO INFORMATION OF DELETED TYPES
PH05675 ON ANY UCD OBJECT CONFIGURATION, USER IS ARE ABLE TO ADD ALLCONFIGURATION TYPES.
PH04193 RESOURCE FILE COMPARISON DEFAULTS TO FILE DIFF ON EMPTY PROPERTY
PH03367 THE TOOLTIP FOR REQUIRED ROLE ON AN APPLICATION PROCESS ISMISLEADING
PH02711 A REQUIRED ROLE FOR A PROCESS FROM A COMPONENT TEMPLATE IS NOTEXPORTED/IMPORTED
PH02289 PROPERTIES NOT CREATED BY /CLI/PROCESS/CREATE ANDCREATEGENERICPROCESS
PH01979 MULTIPLE COMPONENT ROLLBACK ON 2ND ATTEMPT ROLLS BACK TO CURRENTVERSION BEING DEPLOYED
PH01822 NULL POINTER EXCEPTION ON THE LOCK PAGE
PH01603 ERRORS IN THE CLI ARE SENT TO SYSTEM OUT RATHER THAN SYSTEMERROR
PH01438 PERFORMANCE ISSUES WITH LARGE NUMBER OF BASE RESOURCES
PI87950 EXECUTING UNZIP STEP ON UCD AGENT ON A .ZIP FILE LARGER THAN4GB FAILS
PI60348 DOWNLOAD ARTIFACTS FAILS WHEN ARTIFACT SET IS VERY LARGE ANDUSING AGENT RELAY

7.0.1.2

PH05739 PROPERTY FIELDS ARE NOT DISPLAYED IN THE WIZARD FOR CREATING ANAPPLICATION FROM A TEMPLATE
PH04974 PROPERTY VALUE NOT DISPLAYED WHEN ASSIGNING TEMPLATE TOCOMPONENT
PH04393 UPDATING ONE COMPONENT ENVIRONMENT PROPERTY CAUSES OTHERCOMPONENT ENVIRONMENT PROPERTY TO BLANK OUT.
PH04216 USER BELONGING TO GROUPS CAN NO LONGER ADD TEAMS TO UCD OBJECTSEVEN IF THEY HAVE MANAGE TEAM PERMISSION.
PH03183 SAVING COMPONENT CHANGES REMOVES VALUES INHERITED FROMTHECOMPONENT TEMPLATE ON THE ENVIRONMENT.
PH02395 INCORRECT UI PERMISSIONS FOR REMOVING BASE RESOURCES FROM ANENVIRONMENT
PH02288 CANNOT SPECIFY DEFAULT RESOURCE IN CREATEGENERICPROCESS AND/CLI/PROCESS/CREATE
PH01983 NO DEFAULT NOTIFICATION TEMPLATE FOR APPROVAL COMPLETED
PH01903 PERFORMANCE ISSUES WHEN REDACTING SECURE PROPERTIES
PH01456 USER UNABLE TO SEE ENVIRONMENT DEPLOYMENT SUMMARY DUE TO ERRORIN THE INVENTORY DETAILS SECTION
PH00376 DUPLICATED FIELDS SHOWN IN ENVIRONMENT CREATION DIALOG
PH00227 FAILING TO COMPLETE PROCESS DUE TO TX STATE IS NOT CLEAN ERROR
PI98120 STEPS SHOW AS FAILED AFTER THE PROCESS WAS CANCELLED
PI98033 PROPERTIES NOT FOLLOWING ORDER OF PRECEDENCE AS DESCRIBED IN THEDOCUMENTATION
PI95030 CUSTOMERS THAT UPGRADE FROM A VERSION OF UCD < 6.2.0 WILL BEMISSING INDICES
PI89045 COMPONENT VERSION CREATION AND DEPLOYMENT RACE CONDITION
PI84762 BASE RESOURCE PROPERTIES ARE NOT VISIBLE ON A SNAPSHOT’SCONFIGURATION PAGE
PI70146 RESTARTING AN AGENT WHILE RUNNING A PLUGIN STEP CAUSES THE STEPTO HANG INDEFINITELY
PH06615 DELETED TYPES ARE STILL VISIBLE IN THE UCD OBJECT TEAMS SELECTOR

7.0.1.1

PH03880 UPGRADING TO 7.0.1.0 WILL SET ALL AUTHORIZED AGENTS TO UNLICENSED
PH01861 UPDATE USERS FAILS IF USER WAS DELETED FROM LDAP
PH01812 TEAM INHERITANCE IS NOT APPLIED AFTER CREATING ENVIRONMENTS BASED ON A RESOURCE TEMPLATE
PH01028 SOME LDAP SERVER IMPLEMENTATIONS HAVE ISSUES SEARCHING ON BASE OBJECT WITH SINGLE-LEVEL SCOPE
PH00515 AUTOMATICALLY INCLUDING AGENTS IN RESOURCES INCLUDES DELETED AGENTS
PI99173 KEEP ME LOGGED IN DOES NOT WORK, INTERMITTENT LOGOUTS
PI97823 ERROR HANDLING AROUND RELAY TOKENS SHOULD BE IMPROVED
PI97631 INCREMENTAL VERSIONS ARE IN REVERSE ORDER WHEN DEPLOYING A SNAPSHOT IN THE COMPONENT VERSIONS POP-UP WINDOW
PI97391 NPE WHEN RUNNING AUTO-CONFIGURE FROM THE ACTIONS MENU
PI97389 AUTO DISCOVERY DOES NOT RUN WHEN AN AGENT POOL IS ADDED TO A RESOURCE
PI97055 USER WITHOUT MANAGE TEAMS ON A RESOURCE CAN DO SO WITH THE CLI COMMAND ADDRESOURCETOTEAM
PI93053 CALENDAR AND DEPLOYMENT HISTORY SHOW XML ENCODED CHARACTERS FOR QUOTES AND OTHER SPECIAL CHARACTERS
PI92703 DOWNLOAD ARTIFACTS STEP RANDOMLY FAILS WITH: STREAM CORRUPT: INVALID HASH: ALGORITHM=MD5,…
PI92583 INVALID DATE FORMAT FOR DEPLOYMENT COUNT REPORT WITH CUSTOM DATE RANGE
PI89053 DELETING A COMPONENT VERSION ERRONEOUSLY REQUIRES APPLICATION PERMISSIONS
PI89031 PROCESS REMAINS IN RUNNING STATE WITH DB2 CLOB SIZE ERROR
PI88396 CANNOT CHANGE COMPONENT TEMPLATE VERSION
PI84685 COMPONENT IMPORTS TAKE A LONG TIME WHEN THEY HAVE MANY COMPONENT AND COMPONENT TEMPLATE PROCESSES
PI78635 SCRIPT BODY EDITOR IN GENERIC PROCESSES DOES NOT HAVE ACE EDITOR.

7.0.1

PI80533 ‘TYPE’ ACCESS CONTROL ISSUE
PH02082 AGENT INSTALLATION DOCUMENTATION NEEDS UPDATE
PI84539 MANAGING SNAPSHOTS REQUIRE MORE PERMISSIONS THAN “MANAGE SNAPSHOTS”
PI86480 INSTALL MULTIPLE COMPONENTS STEP BY COMPONENT TAG DOES NOT SHOW COMPONENT TAG
PI89092 COMPONENT TEMPLATE PROCESS PROPERTIES NOT SET WHEN RUNNING CHAIN OF COMPONENT PROCESSES
PI96163 CLI TEMPLATE IS MISSING INFORMATION IN THE TEMPLATE ABOUT THE OPTIONS FOR CREATING COMPONENTS
PI95195 COMPONENT PROCESS PROPERTY VALUE SET AT THE APPLICATION LEVEL INTO WRAPPED COMPONENT PROCESS
PI98395 LOCKS NOT BEING RELEASED FOR FAILED OR CANCELLED PROCESS
PI52268 PERFORMANCE ISSUES WITH COMPONENT CONFIGURATION ‘BASIC SETTINGS’
PI98193 INCONSISTENT BEHAVIOR BETWEEN THE UI AND CLI COMMAND ADDRESOURCETOTEAM
RFEs included in 7.0.1
61248 IMPORT LDAP GROUPS INTO URBANCODE DEPLOY
93776 ADD RESOURCE AND COMPONENT MAPPING CONFIGURATION TO APPLICATION EXPORT AND IMPORT PROCESS
117577 WHEN CREATING A COMPONENT ENVIRONMENT PROPERTY DEFINITION TO STORE PASSWORD, THE TYPE SHOULD BE SECURE

7.0.0.1

PI94750 ENFORCE DEPLOYED VERSION INTEGRITY IS NOT ENFORCED WHEN UPLOADING ARTIFACTS
PI85059 PROCESS SUCCEEDING EVEN THOUGH AGENT IS OFFLINE
PI87707 NO RECORD OF WHO STARTED A MANUAL VERSION IMPORT
PI97836 CANNOT CREATE APPLICATIONS, COMPONENTS, OR ENVIRONMENTS FROM UDCLIENT WITH INITIAL TEAM MAPPINGS
PI98200 UCD SERVER WRITES EMPTY CONFIG FILE WHEN DISK IS FULL
PH00264 URBANCODE DEPLOY DOES NOT LICENSE WEB AGENTS AUTOMATICALLY
PI75849 UNABLE TO CONFIGURE SSL CIPHER SUITES AND PROTOCOLS FOR THE CODESTATION PORT ON AGENT RELAYS
PI84768 DELETED ENVIRONMENT TYPES ARE DISPLAYED AND NEW ENVIRONMENTS CAN NOT BE CREATED UNLESS DEFAULT TEAM PREFERENCE IS SET TO NONE
PI91452 TABLE WIDGET REQUESTS MORE DATA THAN IT NEEDS
PI91779 CANNOT IMPORT PROCESS WITH FOR EACH TAG STEP
PI92097 COMPONENT ‘CHANGES’ TAB NEEDS TO BE FULLY PAGINATED.
PI93804 AFTER UPGRADE WEB UI NOT ACCESSIBLE BECAUSE OF A JAVA.SECURITY.KEYSTOREEXCEPTION
PI93930 AGENT RELAY SERVICE SCRIPT FAILS WITH SYNTAX ERROR ON AIX USING KORNSHELL
PI94383 6.2.7 AGENTS ARE CREATED AS OFFLINE FROM THE ENVIRONMENT BLUEPRINT AGENT PROTOTYPE PATTERN
PI95199 STEPS WITH “RUN ON CHANGED RESOURCE” ENABLED INSIDE OF A “FOR EACH TAG” STEP CAN RUN ON RESOURCES THAT WITHOUT THE SPECIFIED TAG
PI96304 STEP OUTPUT LOG MAY BE INCOMPLETE WHEN MULTIBYTE CHARACTERS ARE INCLUDED IN OUTPUT MESSAGE
PI96803 USERS CAN ONLY BE REMOVED FROM TEAMS BY USERS WITH THE MANAGE SECURITY PERMISSION
PI98599 RESOURCE “ADD FROM TEMPLATE” ALLOWS DUPLICATE NAMES TO BE CREATED IN THE RESOURCE TREE
PH00259 CREATE AUTHORIZATION REALM BUTTON CAN’T BE CLICKED

7.0.0

PI97296 NO AUDIT ENTRY FOR TOKEN RESTRICTION CREATION/DELETION/MODIFICATION
PI96680 PERFORMANCE ISSUE RUNNING VERSION IMPORTS
PI95364 WILDCARDS ALLOWED IN LOGIN ATTEMPTS AND THE SERVER ATTEMPTS TO BIND AS EACH POSSIBLE USER
PI94746 FULL OUTPUT LOG IS LOADED MULTIPLE TIMES WHEN VIEWED FROM THE WEB UI
PI85316 DB2 RUNS OUT OF TEMPORARY TABLE SPACE WHEN DOWNLOADING DIAGNOSTICS BUNDLE
PI84803 DEFAULT IMPERSONATION CONFIGURED AT GROUP RESOURCE DISAPPEARED IN VERSION 6.2.3.0
PI90695 UC AUTO DISCOVERY DOES NOT HAVE THE MANAGE PROPERTIES PERMISSION BY DEFAULT
PI83112 DEPLOYMENT MAY FAIL WHEN DEPLOYING A LOCKED SNAPSHOT AFTER COMPONENT TEMPLATE CHANGE
PI79778 PERMISSION ISSUE WITH CALENDAR
PI77918 UPDATERESOURCE DOES NOT UPDATE ROLE PROPERTY IF NO ROLE SPECIFIED
PI57090 UDCLIENT DOES NOT VERIFY SOURCECONFIGPLUGIN AGAINST THE COMPONENT TEMPLATE WHEN CREATING A COMPONENT
PI45504 UCD CAN BE IMPROPERLY CACHED BY THE BROWSER
PI95169 DELETED COMPONENT TEMPLATE IS STILL BEING USED BY COMPONENTS AND CHANGED BY HITTING ITS URL DIRECTLY
PI97584 STEPS NEVER COMPLETING SHOW RUNNING
PI99494 COMPONENT PROPERTIES FROM TEMPLATE ARE NOT VISIBLE