IBM Support

TestFixes included in ClearCase 9.x

News


Abstract

This technote provides you detailed information regarding TestFixes that are included and excluded in the IBM® Rational ClearCase 9.x.

Content

Occasionally TestFixes are created to help resolve specific customer situations. This technote summarizes which test fixes are included, as well as those which are NOT included in the latest Releases, Fix Packs and iFixes.

 

Review the TestFix information for ClearCase 7.0 for information regarding TestFixes that are included and excluded in the IBM® Rational ClearCase 7.x releases.

Table of Contents:

Rational ClearCase 9.1.0.1 released June 29, 2021

TestFix details for ClearCase 9.1.0.1

Test fixes included

Testfix Issue Notes
CHCLS00147591 Poor performance working with activities in ClearTeamExplorer in ClearCase 9.0.1.x APAR PH33498
CHCLS00147533 "Manually umounting automounted VOBs will prevent them from being automatically remounted when accessed through view-extended paths. APAR PH33465
CHCLS00148057 ClearCase users on Red Hat 7.x may see intermittent delays in the execution of some commands in a dynamic view. APAR PH34446
CHCLS00147358 'ls' of a filesystem directory returning incomplete results when performed through a view extended path on EXT4. APAR PH33132
CHCLS00141972 Creation of automatic views fails if user region mapping is in use if the user is mapped to a region other than the WAN server's APAR PH25873
CHCLS00056313 CMI integration cores on linux_x86 if LANG set to non-UTF8 value APAR PH33653PI85648
Testfix Issue Notes
CHCLS00138524 PROPERTIES WINDOW DOES NOT SHOW CONTENTS IN CLEARTEAM EXPLORER APAR PH21223
CHCLS00142753 Fix for CHCLS00116456/PH01069 (Properties window is not displayed correctly in CTE) failed on Linux clients APAR PH26796

Rational ClearCase 9.1 released October 13, 2020

TestFix details for ClearCase 9.1

Test fixes included

Testfix Issue Notes

Rational ClearCase 9.0.2.4 released June 29, 2021

TestFix details for ClearCase 9.0.2.4

Test fixes included

Testfix Issue Notes
none
Testfix Issue Notes
CHCLS00147591 Poor performance working with activities in ClearTeamExplorer in ClearCase 9.0.1.x APAR PH33498
CHCLS00147533 "Manually umounting automounted VOBs will prevent them from being automatically remounted when accessed through view-extended paths. APAR PH33465
CHCLS00148057 ClearCase users on Red Hat 7.x may see intermittent delays in the execution of some commands in a dynamic view. APAR PH34446
CHCLS00147358 'ls' of a filesystem directory returning incomplete results when performed through a view extended path on EXT4. APAR PH33132
CHCLS00141972 Creation of automatic views fails if user region mapping is in use if the user is mapped to a region other than the WAN server's APAR PH25873
CHCLS00056313 CMI integration cores on linux_x86 if LANG set to non-UTF8 value APAR PH33653
Testfix Issue Notes
CHCLS00138524 PROPERTIES WINDOW DOES NOT SHOW CONTENTS IN CLEARTEAM EXPLORER APAR PH21223
CHCLS00142753 Fix for CHCLS00116456/PH01069 (Properties window is not displayed correctly in CTE) failed on Linux clients APAR PH26796
Testfix Issue Notes
CHCLS00138524 PROPERTIES WINDOW DOES NOT SHOW CONTENTS IN CLEARTEAM EXPLORER APAR PH21223

Rational ClearCase 9.0.2.3 released December 18, 2020

TestFix details for ClearCase 9.0.2.3

Test fixes included

Testfix Issue Notes
CHCLS00143435 Clearmake attempts to print certain build statistics after the containing structure was freed. Causing sporadic crashes. APAR PH27795
CHCLS00138260 "Failed to record hostname" creating a view in ClearCase on RHEL 7. APAR PH20838
CHCLS00144046 MVFS fail on its load due to big registry keys on share list. APAR PH28419
CHCLS00143514 CTE needs to provide a mechanism for users to select/provide a certificate friendly name instead of "CTESmartCardCert". RFE
CHCLS00145395 Clearcase OSLC integration throws error messages failing to execute squidtool after upgrade to CC/CQ 9.0.1.10 APAR PH30138
CHCLS00051862 CtCmd: "Aborted" message when doing a checkout or mkview or mkvob. APAR PI85648
Testfix Issue Notes
Testfix Issue Notes
CHCLS00127223 CLEARCASE AUTOMATION LIBRARY (CAL) MAY CRASH ON ITERATING METADATA TYPES IN 9.0.1.X. APAR PH09114

Rational ClearCase 9.0.2.1 released March 27, 2020

TestFix details for ClearCase 9.0.2.1

Testfix Issue Notes
CHCLS00137294 Adding large numbers of files to source control using CTE may cause some files to be in lost+found instead of the expected directories. APAR PH19721
CHCLS00135121 In 9.0.1.7, attempts to create a view based on a view profile fail and invalid registry entries created in HKCU user registry APAR PH17597
CHCLS00136592 Segmentation fault running binary file built in dynamic view context APAR PH18960
CHCLS00138982 ClearCase 9.0.2 shipped with an incorrectly signed driver, preventing its load post install. APAR PH22017
Right clicking on an excluded file in a VS 2017 project throws *8* unhandled exceptions in CTCommands.cpp Line 72 APAR PH21997

Rational ClearCase 9.0.2 released Jan. 7, 2020

TestFix details for ClearCase 9.0.2

Test fixes included

Test fixes not included

Testfix Issue Notes
CHCLS00132671 squidtool ShowActivityProperties throws a double-free error on Linux. APAR PH18585
CHCLS00135373 TSO CLIENT CHECKOUT ERROR: NO SUCH FILE OR DIRECTORY. APAR PH17973
CHCLS00135576 Byte range lock key may not be forwarded to the underlying FS. APAR PH18122
CHCLS00134842 Operations requiring a vob_server process started during a protectvob operation will cause a persistent outage for that VOB. APAR PH17193

Rational ClearCase 9.0.1.12 released June 29, 2021

TestFix details for ClearCase 9.0.1.12

Test fixes included

Testfix Issue Notes
CHCLS00147591 Poor performance working with activities in ClearTeamExplorer in ClearCase 9.0.1.x APAR PH33498
CHCLS00147533 "Manually umounting automounted VOBs will prevent them from being automatically remounted when accessed through view-extended paths. APAR PH33465
CHCLS00148057 ClearCase users on Red Hat 7.x may see intermittent delays in the execution of some commands in a dynamic view. APAR PH34446
CHCLS00147358 'ls' of a filesystem directory returning incomplete results when performed through a view extended path on EXT4. APAR PH33132
CHCLS00141972 Creation of automatic views fails if user region mapping is in use if the user is mapped to a region other than the WAN server's APAR PH25873
CHCLS00056313 CMI integration cores on linux_x86 if LANG set to non-UTF8 value APAR PH33653
Testfix Issue Notes
CHCLS00138524 PROPERTIES WINDOW DOES NOT SHOW CONTENTS IN CLEARTEAM EXPLORER APAR PH21223
CHCLS00142753 Fix for CHCLS00116456/PH01069 (Properties window is not displayed correctly in CTE) failed on Linux clients APAR PH26796

Rational ClearCase 9.0.1.11 released December 18, 2020

TestFix details for ClearCase 9.0.1.11

Test fixes included

Testfix Issue Notes
none
None

TestFix details for ClearCase 9.0.1.11

Test fixes included

Testfix Issue Notes CHCLS00143435 Clearmake attempts to print certain build statistics after the containing structure was freed. Causing sporadic crashes. APAR PH27795 CHCLS00138260 "Failed to record hostname" creating a view in ClearCase on RHEL 7. APAR PH20838 CHCLS00144046 MVFS fail on its load due to big registry keys on share list. APAR PH28419 CHCLS00143514 CTE needs to provide a mechanism for users to select/provide a certificate friendly name instead of "CTESmartCardCert". RFE CHCLS00145395 Clearcase OSLC integration throws error messages failing to execute squidtool after upgrade to CC/CQ 9.0.1.10 APAR PH30138 CHCLS00051862 CtCmd: "Aborted" message when doing a checkout or mkview or mkvob. APAR PI85648
Testfix Issue Notes

Rational ClearCase 9.0.1.10 released June 25, 2020

TestFix details for ClearCase 9.0.1.10

Test fixes included

Testfix Issue Notes
none
None
Testfix Issue Notes
CHCLS00127223 CLEARCASE AUTOMATION LIBRARY (CAL) MAY CRASH ON ITERATING METADATA TYPES IN 9.0.1.X APAR PH09114
Testfix Issue Notes
CHCLS00137294 Adding large numbers of files to source control using CTE may cause some files to be in lost+found instead of the expected directories APAR PH19721
CHCLS00135121 In 9.0.1.7, attempts to create a view based on a view profile fail and invalid registry entries created in HKCU user registry APAR PH17597
CHCLS00136592 Segmentation fault running binary file built in dynamic view context APAR PH18960
CHCLS00138972 Right clicking on an excluded file in a VS 2017 project throws *8* unhandled exceptions in CTCommands.cpp Line 72. APAR PH21997

Rational ClearCase 9.0.1.8 released Sept 19, 2019

TestFix details for ClearCase 9.0.1.8

Test fixes included

Testfix Issue Notes
CHCLS00138982 ClearCase 9.0.2 shipped with an incorrectly signed driver, preventing its load post install. APAR PH22017
Testfix Issue Notes
CHCLS00114635 Internal error in MVFS panel on install of ClearCase 9.0.1.7 APAR PH13954
CHCLS00132125 Windows explorer integration has multiple issues after 9.0.1.7 install/upgrade APAR PH13977
CHCLS00129166 ClearCase4Cds label function failed for cells with special character in cell name APAR PH08215
CHCLS00123950 clearmake sun emulation fails to process build script containing direct and indirect invocations of same macro APAR PH05225
CHCLS00132073 Omake corrupts make macro definitions when multiple macros are added together. APAR PH13952
CHCLS00131564 ClearCase JIRA integration reports invalid XML or invalid JSON (version dependent) when attempting to run ct settask -find. APAR PH13312
CHCLS00127588 vob_server RPC's timeout due to windows socket irregularities causing misdirected RPC's APAR PH09425

Test fixes not included

Testfix Issue Notes
CHCLS00133222 Subtle thread race on clearmake shutdown causes pipe write failures.
CHCLS00133886 Clearmake fails to shut down hosts in 1 CCASE_BLD_HOSTS override when the value of the override changes.
CHCLS00132732 UNIX/Linux snapshot view with Windows view_server host: rmview by view owner fails APAR PH14795

Rational ClearCase 9.0.1.7 released June 20, 2019

TestFix details for ClearCase 9.0.1.7

Test fixes included

Testfix Issue Notes
CHCLS00114635 Broken pipe: Error detected in "/vobs/atria/lib/vob/map_cache. c" line 2465 APAR PI98888
CHCLS00125911 CtCmd does not honor changed umasks before view creation APAR PH07824
CHCLS00126287 A newly created or newly imported ACL-enabled VOB on local storage may report all elements as misprotected. APAR PH08215
CHCLS00130367 credmap user names fails from UNIX client to Windows server APAR PH12090

Test fixes not included

Testfix Issue Notes
CHCLS00128725 Error: getgrgid_r buffer overflow. error when performing cleartool commands due to VERY large groups APAR PH10602

Rational ClearCase 9.0.1.6 released March 21, 2019

TestFix details for ClearCase 9.0.1.6

Test fixes included

Testfix Issue Notes
CHCLS00051910 VS2015 OPEN FILES NOT PART OF A PROJECT TRIGGER A MKBRANCH OPERATION APAR PI89145
CHCLS00123276 RIGHT CLICK ANY TYPE OF VERSIONED FILE (ANY EXTENSION) & SELECT THE "COMPARE WITH PREDECESSOR" VERSION ON PORTUGUESE WINDOWS OS APAR PH04203
CHCLS00124843 Sending Multisite packets from fully-64-bit 9.0.1.5 hosts fails with "no more memory available" errors APAR PH06465
CHCLS00051683 EXECUTION OF SOME BCL SCRIPTS RESULTS IN 306-0C ABEND ERROR APAR PI58773
CHCLS00125074 RCCBUILD version mismatch with ClearCase blocks customer builds APAR PH06768
CHCLS00125824 CtCmd: enable Perl 64 bit support for  CtCmd on linux_x86_64
CHCLS00126877 Using a newly created ClearQuest activity on checkout in CTE causes popup error message APAR PH08617

Test fixes not included

Testfix Issue Notes
CHCLS00123950 clearmake sun emulation fails to process build script containing direct and indirect invocations of same macro APAR PH05225
CHCLS00125911 CtCmd does not honor changed umasks before view creation APAR PH07824

Rational ClearCase 9.0.1.5 released November 15, 2018

TestFix details for ClearCase 9.0.1.5

Test fixes included

Testfix Issue Notes
CHCLS00114635 "Broken pipe: Error detected in "/vobs/atria/lib/vob/map_cache. c" line 2465 APAR PI98888
CHCLS00113737 CAL applications crash attempting to access lbtype metadata after CC 9.0.1 upgrade APAR PI97865

Test fixes not included

Testfix Issue Notes
CHCLS00122736 Move vista.* file locking control to db core control instead of the underlying runtime. APAR PH03537

TestFix details for ClearCase 9.0.1.4

Test fixes included

Testfix Issue Notes
CHCLS00102727 "Windows database dumper crashes during reformatting Schema 54 UCM PVOB starting with 9.0.1.1 APAR PI95266

Test fixes not included

Testfix Issue Notes
CHCLS00114635 Broken pipe: Error detected in "/vobs/atria/lib/vob/map_cache. c" line 2465 APAR PI98888

Rational ClearCase 9.0.1.3 released April 30, 2018

TestFix details for ClearCase 9.0.1.3

Test fixes included

Testfix Issue Notes
CQPAR00226443 "TOO MANY LINKS" ERROR IS RETURNED WHEN LISTING DIRECTORY CONTENTS APAR PI90814
CQPAR00219376 D-STATE PROCESSES IN CLEARCASE ENVIRONMENT APAR PI85611
CQPAR00230944 RHEL 7.3 LS HANGS OR GETS SYSTEM CRASHES WHEN ACCESSING A VOB VIA VIEW EXTENDED PATH APAR PI93635
CQPAR00229626 GROUPS LISTED AS "NOBODY" IN THE GROUP LIST OF NEW VOB'S, VIEWS AND ELEMENTS IF THEY HAVE OVER 8000 USERS. APAR PI92920

Rational ClearCase 9.0.1.2 released December 18, 2017

TestFix details for ClearCase 9.0.1.2

Test fixes included

Testfix Issue Notes
CQPAR00221112 CLEARCASE ON WINDOWS CANNOT MAP CREDENTIALS TO SUPPORT ACL ENABLED VOBS IN AN INTEROP ENVIRONMENT APAR PI87052

Test fixes not included

Testfix Issue Notes
CQPAR00219385 APAR PI76489 NOT RESOLVED IN CTCMD 1.11 ON CPAN. APAR PI85648

Rational ClearCase 9.0.1.1 released September 13, 2017

TestFix details for ClearCase 9.0.1.1

Test fixes included

Testfix Issue Notes
CQPAR00212812 CLEARMRGMAN CORES DUMPS DURING CHECKIN APAR PI81434
CQPAR00215358 CLEARCASE REMOTE CLIENT LOGIN FAILS FOR NUMERIC ONLY USER ACCOUNTS APAR PI82948
CQPAR00215728 READING LARGE FILES IN DYNAMIC VIEWS MUCH SLOWER AFTER UPDATING FROM SUSE LINUX 11 TO SUSE LINUX 12. APAR PI83215
CQPAR00208934 FAILED TO GET UDEV DEVICE FROM DEVNUM APAR PI78498
CQPAR00219376 D-STATE PROCESSES IN CLEARCASE ENVIRONMENT APAR PI85611

Rational ClearCase 9.0.1.0 released June 15, 2017

TestFix details for ClearCase 9.0.1.0

Test fixes included

Testfix Issue Notes
CQPAR00206461 Request to add a comment When Rename/Checkin of Cell (Cadence Integration) RFE
CQPAR00205859 CHECKOUT USING CTCMD.PM MODULE ABORT JUST BEFORE CHMOD SYSCALL APAR PI76489
CQPAR00208422 CLEARCASE MVFS WILL NOT BUILD AFTER UPDATE TO POST-RELEASE KERNEL ON SUSE 12 SP2 HOST APAR PI78185
CQPAR00208996 REBUILD MVFS FAILED WITH ERROR ON MVFS_MDEP_LINUX.C APAR PI78636
CQPAR00205950 CLEARTOOL RMVIEW OF A DYNAMIC VIEW ON AIX TAKES 30 SECONDS TO COMPLETE APAR PI76681
CQPAR00205466 CUSTOMIZATIONS DO NOT LOAD CORRECTLY AFTER UPGRADING TO CLEARCASE 8.0.1.13 APAR PI76420
CQPAR00207928 CTE INITIATE MULTIPLE CQWEB SESSIONS APAR PI77782
CQPAR00211719 BSOD ON WINDOWS SYSTEM_THREAD_EXCEPTION_NOT_HANDLED (7E) APAR PI80609

Test fixes not included

Testfix Issue Notes
CQPAR00205486 CLEARCASE MVFS WILL NOT LOAD ON WINDOWS 10 ENTERPRISE ENTERPRISE 1607 IF DEVICEGUARD ENABLED APAR PI78319
CQPAR00209840 XLSVTREE AND XCLEARCASE HANG WHEN STARTED WITH AN INVALID PATH APAR PI79130

Rational ClearCase 9.0.0.6 released December 18, 2017

TestFix details for ClearCase 9.0.0.6

Test fixes included

Testfix Issue Notes
CQPAR00221112 CLEARCASE ON WINDOWS CANNOT MAP CREDENTIALS TO SUPPORT ACL ENABLED VOBS IN AN INTEROP ENVIRONMENT APAR PI87052

Test fixes not included

Testfix Issue Notes
CQPAR00219385 APAR PI76489 NOT RESOLVED IN CTCMD 1.11 ON CPAN. APAR http://www.ibm.com/support/docview.wss?uid=swg1PI85648" TARGET="_blank">PI85648

Rational ClearCase 9.0.0.5 released September 13, 2017

TestFix details for ClearCase 9.0.0.5

Test fixes included

Testfix Issue Notes
CQPAR00212812 CLEARMRGMAN CORES DUMPS DURING CHECKIN APAR PI81434
CQPAR00215358 CLEARCASE REMOTE CLIENT LOGIN FAILS FOR NUMERIC ONLY USER ACCOUNTS APAR PI82948
CQPAR00215728 READING LARGE FILES IN DYNAMIC VIEWS MUCH SLOWER AFTER UPDATING FROM SUSE LINUX 11 TO SUSE LINUX 12. APAR PI83215
CQPAR00208934 FAILED TO GET UDEV DEVICE FROM DEVNUM APAR PI78498
CQPAR00219376 D-STATE PROCESSES IN CLEARCASE ENVIRONMENT APAR PI85611

Rational ClearCase 9.0.0.4 released March 15, 2017

TestFix details for ClearCase 9.0.0.4

Test fixes included

Testfix Issue Notes
CQPAR00199794 CLEARMAKE MAY HANG ON LINUX WHEN ATTEMPTING TO EXECUTE A CHILD MAKE OR BUILD SCRIPT APAR PI72644
CQPAR00191349 RACE CONDITION CAN CAUSE CLEARCASE REMOTE CLIENT SERVER TO REACHTHE MAX CONNECTION LIMIT APAR PI67531
CQPAR00175802 "BROWSE RESOURCES TO LABEL" NOT INCLUDING SUB-DIRECTORIES IN CTE "APPLY LABEL" WIZARD APAR PI58795

Test fixes not included

Testfix Issue Notes
CQPAR00198795 CREATING OR DELETING CROSS VOB HLINKS CAN LEAD TO 'DEAD MAN LOCK TIMEOUT' ERROR APAR PI72025
CQPAR00205466 CUSTOMIZATIONS DO NOT LOAD CORRECTLY AFTER UPGRADING TO CLEARCASE 8.0.1.13 APAR PI76420

Rational ClearCase 9.0.0.3 released December 7, 2016

TestFix details for ClearCase 9.0.0.3

Test fixes included

Testfix Issue Notes
CQPAR00196359 CLOSING VIEW PRIVATE FILE FROM THE VS 2015 GUI RESULTS IN 'CTPACKAGE.DLL' APPLICATION CRASH APAR PI70543
CCM 62691 handle logout or shutdown on Windows NA

Test fixes not included

Testfix Issue Notes
CQPAR00181342 Hang during a build APAR PI61697

Rational ClearCase 9.0.0.2 released Sept. 14, 2016

TestFix details for ClearCase 9.0.0.2

Test fixes included

Testfix Issue Notes
CQPAR00181348 VIEW NAME DOES NOT APPEAR IN RDZ CTE EXTENSION APAR PI61718
CQPAR00183668 BSOD WHEN WORKING IN DYNAMIC VIEWS APAR PI62729
WI62143 UI freeze of Edit configuration dialog in Automatic view context
CQPAR00191349 RACE CONDITION CAN CAUSE CLEARCASE REMOTE CLIENT SERVER TO REACH THE MAX CONNECTION LIMIT APAR PI67531
CQPAR00191864 REQUEST FOR MASTERSHIP TO A CLEARCASE 9 VOB SERVER GENERATES A FEATURE LEVEL 9 OPLOG IN A FEATURE LEVEL 8 VOB APAR PI67810

Rational ClearCase 9.0.0.1 released May 27, 2016

TestFix details for ClearCase 9.0.0.1

Test fixes included

Testfix Issue Notes
WI60889 Security Bulletin: Multiple vulnerabilities in IBM Java Runtime affect IBM Rational ClearCase (CVE-2015-7575, CVE-2015-4872, CVE-2015-4893, CVE-2015-4803) http://www.ibm.com/support/docview.wss?uid=swg21976573
CQPAR00166238 Hang in dynamic views caused by a race condition APAR PI53747
CQPAR00157156 System hang during a large build using CC dynamic views APAR PI49353
CQPAR00155703 BSOD running an audited build with the MVFS cache manager enabled APAR PI48853
CQPAR00176361 BSOD with bad_pool_header (19) APAR PI58916
CQPAR00178251 ClearTeam Explorer Context menu options appear disabled in RDZ APAR PI60065



Rational ClearCase 9.0 released March 17, 2016

TestFix details for ClearCase 9.0.0

Test fixes included

Testfix Issue Notes
CQPAR00165335 Delays executing calls in CC due to VOBRPC_server startup APAR PI53364
RFE CCM 60355 Relax version check in CC cadence integration so that ICADV 122 can be used with it

[{"Type":"MASTER","Line of Business":{"code":"LOB36","label":"IBM Automation"},"Business Unit":{"code":"BU053","label":"Cloud & Data Platform"},"Product":{"code":"SSSH27","label":"Rational ClearCase"},"ARM Category":[{"code":"a8m50000000L0i5AAC","label":"ClearCase"}],"ARM Case Number":"","Platform":[{"code":"PF002","label":"AIX"},{"code":"PF016","label":"Linux"},{"code":"PF027","label":"Solaris"},{"code":"PF033","label":"Windows"}],"Version":"9.0.1;9.0.2;9.1.0"}]

Document Information

Modified date:
25 June 2021

UID

swg21979124