IBM Support

Regression test results using Boost 1.55.0 with XL C/C++ for AIX, V13.1

Product Documentation


Abstract

This document contains detailed regression test results for XL C/C++ for AIX, V13.1 using the Boost 1.55.0 libraries.

Content

Compiler status: IBM AIX (V6.1/V7.1)
Run date: Monday, 28 July 2014

 

 

Library Test name XL C/C++
accumulators count PASSED
accumulators covariance PASSED
accumulators droppable PASSED
accumulators error_of PASSED
accumulators extended_p_square PASSED
accumulators extended_p_square_quantile PASSED
accumulators external_accumulator PASSED
accumulators external_weights PASSED
accumulators kurtosis PASSED
accumulators max PASSED
accumulators mean PASSED
accumulators median PASSED
accumulators min PASSED
accumulators moment PASSED
accumulators p_square_cumul_dist PASSED
accumulators p_square_quantile PASSED
accumulators pot_quantile PASSED
accumulators reference PASSED
accumulators rolling_count PASSED
accumulators rolling_mean PASSED
accumulators rolling_sum PASSED
accumulators skewness PASSED
accumulators sum PASSED
accumulators sum_kahan PASSED
accumulators tail PASSED
accumulators tail_mean PASSED
accumulators tail_quantile PASSED
accumulators tail_variate_means PASSED
accumulators valarray PASSED
accumulators variance PASSED
accumulators vector PASSED
accumulators weighted_covariance PASSED
accumulators weighted_extended_p_square PASSED
accumulators weighted_kurtosis PASSED
accumulators weighted_mean PASSED
accumulators weighted_median PASSED
accumulators weighted_moment PASSED
accumulators weighted_p_square_cumul_dist PASSED
accumulators weighted_p_square_quantile PASSED
accumulators weighted_pot_quantile PASSED
accumulators weighted_skewness PASSED
accumulators weighted_sum PASSED
accumulators weighted_sum_kahan PASSED
accumulators weighted_tail_mean PASSED
accumulators weighted_tail_quantile PASSED
accumulators weighted_tail_variate_means PASSED
accumulators weighted_variance PASSED
algorithm all_of_test PASSED
algorithm any_of_test PASSED
algorithm clamp_test PASSED
algorithm conv PASSED
algorithm copy_if_test1 PASSED
algorithm copy_n_test1 PASSED
algorithm empty_search_test PASSED
algorithm equal_test PASSED
algorithm find PASSED
algorithm find_format PASSED
algorithm find_if_not_test1 PASSED
algorithm gather_fail1 PASSED
algorithm gather_test1 PASSED
algorithm hex_fail1 PASSED
algorithm hex_test1 PASSED
algorithm hex_test2 PASSED
algorithm hex_test3 PASSED
algorithm hex_test4 PASSED
algorithm iota_test1 PASSED
algorithm is_partitioned_test1 PASSED
algorithm is_permutation_test1 PASSED
algorithm join PASSED
algorithm minmax PASSED
algorithm minmax_element PASSED
algorithm mismatch_test PASSED
algorithm none_of_test PASSED
algorithm one_of_test PASSED
algorithm ordered_test PASSED
algorithm partition_copy_test1 PASSED
algorithm partition_point_test1 PASSED
algorithm predicate PASSED
algorithm regex PASSED
algorithm replace PASSED
algorithm search_fail1 PASSED
algorithm search_fail2 PASSED
algorithm search_fail3 PASSED
algorithm search_test1 PASSED
algorithm search_test2 PASSED
algorithm search_test3 PASSED
algorithm search_test4 PASSED
algorithm split PASSED
algorithm trim PASSED
any any_cast_cv_failed PASSED
any any_test PASSED
any any_test_cv_to_rv_failed PASSED
any any_test_rv PASSED
any any_test_temporary_to_ref_failed PASSED
array array0 PASSED
array array1 PASSED
array array2 PASSED
array array3 PASSED
array array4 PASSED
array array5 PASSED
array array6 PASSED
array array_hash PASSED
asio basic_datagram_socket PASSED
asio basic_datagram_socket_select PASSED
asio basic_deadline_timer PASSED
asio basic_deadline_timer_select PASSED
asio basic_raw_socket PASSED
asio basic_raw_socket_select PASSED
asio basic_seq_packet_socket PASSED
asio basic_seq_packet_socket_select PASSED
asio basic_signal_set PASSED
asio basic_signal_set_select PASSED
asio basic_socket_acceptor PASSED
asio basic_socket_acceptor_select PASSED
asio basic_stream_socket PASSED
asio basic_stream_socket_select PASSED
asio basic_streambuf PASSED
asio basic_streambuf_select PASSED
asio basic_waitable_timer PASSED
asio basic_waitable_timer_select PASSED
asio buffer PASSED
asio buffer_select PASSED
asio buffered_read_stream PASSED
asio buffered_read_stream_select PASSED
asio buffered_stream PASSED
asio buffered_stream_select PASSED
asio buffered_write_stream PASSED
asio buffered_write_stream_select PASSED
asio buffers_iterator PASSED
asio buffers_iterator_select PASSED
asio completion_condition PASSED
asio completion_condition_select PASSED
asio connect PASSED
asio connect_select PASSED
asio coroutine PASSED
asio coroutine_select PASSED
asio datagram_socket_service PASSED
asio datagram_socket_service_select PASSED
asio deadline_timer PASSED
asio deadline_timer_select PASSED
asio deadline_timer_service PASSED
asio deadline_timer_service_select PASSED
asio error PASSED
asio error_select PASSED
asio generic_basic_endpoint PASSED
asio generic_basic_endpoint_select PASSED
asio generic_datagram_protocol PASSED
asio generic_datagram_protocol_select PASSED
asio generic_raw_protocol PASSED
asio generic_raw_protocol_select PASSED
asio generic_seq_packet_protocol PASSED
asio generic_seq_packet_protocol_select PASSED
asio generic_stream_protocol PASSED
asio generic_stream_protocol_select PASSED
asio high_resolution_timer PASSED
asio high_resolution_timer_select PASSED
asio io_service PASSED
asio io_service_select PASSED
asio ip_address PASSED
asio ip_address_select PASSED
asio ip_address_v4 PASSED
asio ip_address_v4_select PASSED
asio ip_address_v6 PASSED
asio ip_address_v6_select PASSED
asio ip_basic_endpoint PASSED
asio ip_basic_endpoint_select PASSED
asio ip_basic_resolver PASSED
asio ip_basic_resolver_entry PASSED
asio ip_basic_resolver_entry_select PASSED
asio ip_basic_resolver_iterator PASSED
asio ip_basic_resolver_iterator_select PASSED
asio ip_basic_resolver_query PASSED
asio ip_basic_resolver_query_select PASSED
asio ip_basic_resolver_select PASSED
asio ip_host_name PASSED
asio ip_host_name_select PASSED
asio ip_icmp PASSED
asio ip_icmp_select PASSED
asio ip_multicast PASSED
asio ip_multicast_select PASSED
asio ip_resolver_query_base PASSED
asio ip_resolver_query_base_select PASSED
asio ip_resolver_service PASSED
asio ip_resolver_service_select PASSED
asio ip_tcp PASSED
asio ip_tcp_select PASSED
asio ip_udp PASSED
asio ip_udp_select PASSED
asio ip_unicast PASSED
asio ip_unicast_select PASSED
asio ip_v6_only PASSED
asio ip_v6_only_select PASSED
asio local_basic_endpoint PASSED
asio local_basic_endpoint_select PASSED
asio local_connect_pair PASSED
asio local_connect_pair_select PASSED
asio local_datagram_protocol PASSED
asio local_datagram_protocol_select PASSED
asio local_stream_protocol PASSED
asio local_stream_protocol_select PASSED
asio placeholders PASSED
asio placeholders_select PASSED
asio posix_basic_descriptor PASSED
asio posix_basic_descriptor_select PASSED
asio posix_basic_stream_descriptor PASSED
asio posix_basic_stream_descriptor_select PASSED
asio posix_descriptor_base PASSED
asio posix_descriptor_base_select PASSED
asio posix_stream_descriptor PASSED
asio posix_stream_descriptor_select PASSED
asio posix_stream_descriptor_service PASSED
asio posix_stream_descriptor_service_select PASSED
asio raw_socket_service PASSED
asio raw_socket_service_select PASSED
asio read PASSED
asio read_at PASSED
asio read_at_select PASSED
asio read_select PASSED
asio read_until PASSED
asio read_until_select PASSED
asio seq_packet_socket_service PASSED
asio seq_packet_socket_service_select PASSED
asio signal_set PASSED
asio signal_set_select PASSED
asio signal_set_service PASSED
asio signal_set_service_select PASSED
asio socket_acceptor_service PASSED
asio socket_acceptor_service_select PASSED
asio socket_base PASSED
asio socket_base_select PASSED
asio steady_timer PASSED
asio steady_timer_select PASSED
asio strand PASSED
asio strand_select PASSED
asio stream_socket_service PASSED
asio stream_socket_service_select PASSED
asio streambuf PASSED
asio streambuf_select PASSED
asio system_timer PASSED
asio system_timer_select PASSED
asio time_traits PASSED
asio time_traits_select PASSED
asio wait_traits PASSED
asio wait_traits_select PASSED
asio waitable_timer_service PASSED
asio waitable_timer_service_select PASSED
asio windows_basic_handle PASSED
asio windows_basic_handle_select PASSED
asio windows_basic_object_handle PASSED

 

 

asio windows_basic_object_handle_select PASSED
asio windows_basic_random_access_handle PASSED
asio windows_basic_random_access_handle_select PASSED
asio windows_basic_stream_handle PASSED
asio windows_basic_stream_handle_select PASSED
asio windows_object_handle PASSED
asio windows_object_handle_select PASSED
asio windows_object_handle_service PASSED
asio windows_object_handle_service_select PASSED
asio windows_overlapped_ptr PASSED
asio windows_overlapped_ptr_select PASSED
asio windows_random_access_handle PASSED
asio windows_random_access_handle_select PASSED
asio windows_random_access_handle_service PASSED
asio windows_random_access_handle_service_select PASSED
asio windows_stream_handle PASSED
asio windows_stream_handle_select PASSED
asio windows_stream_handle_service PASSED
asio windows_stream_handle_service_select PASSED
asio write PASSED
asio write_at PASSED
asio write_at_select PASSED
asio write_select PASSED
asio is_read_buffered FAILED
asio is_read_buffered_select FAILED
asio is_write_buffered FAILED
asio is_write_buffered_select FAILED
assign basic PASSED
assign email_example PASSED
assign list_inserter PASSED
assign list_of PASSED
assign list_of_workaround PASSED
assign multi_index_container PASSED
assign my_vector_example PASSED
assign ptr_list_inserter PASSED
assign ptr_list_of PASSED
assign ptr_map_inserter PASSED
assign static_list_of PASSED
assign std PASSED
assign tuple_list_of PASSED
atomic atomicity PASSED
atomic fallback_api PASSED
atomic lockfree PASSED
atomic native_api PASSED
atomic ordering PASSED
bimap assign PASSED
bimap foreach PASSED
bimap lambda PASSED
bimap property_map PASSED
bimap range PASSED
bimap serialization PASSED
bimap test_bimap_assign PASSED
bimap test_bimap_convenience_header PASSED
bimap test_bimap_extra PASSED
bimap test_bimap_info PASSED
bimap test_bimap_info_1 PASSED
bimap test_bimap_info_2 PASSED
bimap test_bimap_info_3 PASSED
bimap test_bimap_lambda PASSED
bimap test_bimap_list_of PASSED
bimap test_bimap_modify PASSED
bimap test_bimap_multiset_of PASSED
bimap test_bimap_mutable PASSED
bimap test_bimap_mutable_1 PASSED
bimap test_bimap_mutable_2 PASSED
bimap test_bimap_mutable_3 PASSED
bimap test_bimap_operator_bracket PASSED
bimap test_bimap_ordered PASSED
bimap test_bimap_project PASSED
bimap test_bimap_property_map PASSED
bimap test_bimap_range PASSED
bimap test_bimap_sequenced PASSED
bimap test_bimap_serialization PASSED
bimap test_bimap_set_of PASSED
bimap test_bimap_unconstrained PASSED
bimap test_bimap_unordered PASSED
bimap test_bimap_unordered_multiset_of PASSED
bimap test_bimap_unordered_set_of PASSED
bimap test_bimap_vector_of PASSED
bimap test_mutant PASSED
bimap test_mutant_relation PASSED
bimap test_structured_pair PASSED
bimap test_tagged PASSED
bimap typeof PASSED
bimap xpressive PASSED
bind bind_and_or_test PASSED
bind bind_const_test PASSED
bind bind_cv_test PASSED
bind bind_dm2_test PASSED
bind bind_dm3_test PASSED
bind bind_dm_test PASSED
bind bind_eq2_test PASSED
bind bind_eq3_test PASSED
bind bind_eq_test PASSED
bind bind_fn2_test PASSED
bind bind_fnobj2_test PASSED
bind bind_function_test PASSED
bind bind_lookup_problem_test PASSED
bind bind_mf2_test PASSED
bind bind_not_test PASSED
bind bind_placeholder_test PASSED
bind bind_ref_test PASSED
bind bind_rel_test PASSED
bind bind_rv_sp_test PASSED
bind bind_rvalue_test PASSED
bind bind_stateful_test PASSED
bind bind_test PASSED
bind bind_unary_addr PASSED
bind bind_visit_test PASSED
bind mem_fn_derived_test PASSED
bind mem_fn_dm_test PASSED
bind mem_fn_eq_test PASSED
bind mem_fn_ref_test PASSED
bind mem_fn_rv_test PASSED
bind mem_fn_test PASSED
bind mem_fn_unary_addr_test PASSED
bind mem_fn_void_test PASSED
bind protect_test PASSED
bind ref_fn_test PASSED
chrono arithmetic_pass_h PASSED
chrono chrono_unit_test_d PASSED
chrono chrono_unit_test_h PASSED
chrono clock_clock_p_d PASSED
chrono comparisons_pass_h PASSED
chrono constructor_pass_h PASSED
chrono convert_float_to_int_fail PASSED
chrono convert_inexact_fail PASSED
chrono cycle_count_h PASSED
chrono default_ratio_pass_h PASSED
chrono default_ratio_pass_l PASSED
chrono divide_rep2_fail PASSED
chrono duration_cast_int_fail PASSED
chrono duration_cast_pass_h PASSED
chrono duration_duration_fail PASSED
chrono duration_input_h PASSED
chrono duration_output_h PASSED
chrono duration_values_pass_h PASSED
chrono explore_limits_h PASSED
chrono french_d PASSED
chrono french_h PASSED
chrono i_dont_like_the_default_duration_behavior_h PASSED
chrono implicit_constructot_fail PASSED
chrono io_ex1_d PASSED
chrono io_ex1_h PASSED
chrono io_ex2_h PASSED
chrono io_ex3_d PASSED
chrono io_ex3_h PASSED
chrono io_ex4_d PASSED
chrono io_ex4_h PASSED
chrono io_ex5_d PASSED
chrono io_ex5_h PASSED
chrono manipulate_clock_object_d PASSED
chrono manipulate_clock_object_h PASSED
chrono min_time_point_d PASSED
chrono min_time_point_h PASSED
chrono miscellaneous_h PASSED
chrono modulus_rep2_fail PASSED
chrono non_implicit_convertible_rep_fail PASSED
chrono positive_num_fail PASSED
chrono ratio_alias_pass_h PASSED
chrono ratio_alias_pass_l PASSED
chrono ratio_fail PASSED
chrono rounding_h PASSED
chrono runtime_resolution_h PASSED
chrono saturating_h PASSED
chrono simulated_thread_interface_demo_d PASSED
chrono simulated_thread_interface_demo_h PASSED
chrono test_clock_d PASSED
chrono test_clock_h PASSED
chrono test_duration_h PASSED
chrono test_special_values_h PASSED
chrono test_thread_clock_d PASSED
chrono test_thread_clock_h PASSED
chrono time_point_arithmetic_ext_p_h PASSED
chrono time_point_arithmetic_p_h PASSED
chrono time_point_comparisons_p_h PASSED
chrono time_point_constructor_p_h PASSED
chrono time_point_default_duration_p_h PASSED
chrono time_point_default_duration_p_l PASSED
chrono time_point_equal_f PASSED
chrono time_point_implicit_f PASSED
chrono time_point_input_h PASSED
chrono time_point_less_f PASSED
chrono time_point_min_max_p_h PASSED
chrono time_point_non_implicit_convertible_duration_f PASSED
chrono time_point_not_duration_f PASSED
chrono time_point_time_point_cast_int_f PASSED
chrono time_point_time_point_cast_p_h PASSED
chrono times_rep2_lhs_fail PASSED
chrono times_rep2_rhs_fail PASSED
chrono timeval_demo_h PASSED
chrono traits_common_type_duration_p_h PASSED
chrono traits_common_type_duration_p_l PASSED
chrono traits_common_type_time_point_p_h PASSED
chrono traits_common_type_time_point_p_l PASSED
chrono traits_duration_values_p_h PASSED
chrono traits_treat_as_floating_point_p_h PASSED
chrono traits_treat_as_floating_point_p_l PASSED
chrono treat_as_floating_point_Rep2_true_fail PASSED
chrono two_obj_p_d PASSED
chrono two_obj_p_h PASSED
chrono typedefs_pass_h PASSED
chrono typedefs_pass_l PASSED
chrono types_pass_h PASSED
chrono types_pass_l PASSED
chrono v1_duration_input_h PASSED
chrono v1_duration_output_h PASSED
chrono v1_french_h PASSED
chrono v1_french_s PASSED
chrono v1_io_ex1_h PASSED
chrono v1_io_ex1_s PASSED
chrono v1_io_ex2_h PASSED
chrono v1_io_ex3_h PASSED
chrono v1_io_ex3_s PASSED
chrono v1_io_ex4_h PASSED
chrono v1_io_ex4_s PASSED
chrono v1_io_ex5_h PASSED
chrono v1_io_ex5_s PASSED
chrono v1_time_point_input_h PASSED
chrono v1_time_point_output_h PASSED
chrono win32_test_d PASSED
chrono win32_test_h PASSED
chrono xtime_h PASSED
chrono clock_clock_p_h FAILED
chrono test_7868_d FAILED
chrono test_7868_h FAILED
chrono time_point_output_h FAILED
circular_buffer base_test PASSED
circular_buffer bounded_buffer_comparison PASSED
circular_buffer constant_erase_test PASSED
circular_buffer soft_iterator_invalidation PASSED
circular_buffer space_optimized_test PASSED
concept_check class_concept_check_test PASSED
concept_check class_concept_fail_expected PASSED
concept_check concept_check_fail_expected PASSED
concept_check concept_check_test PASSED
concept_check function_requires_fail PASSED
concept_check old_concept_class_fail PASSED
concept_check old_concept_function_fail PASSED
concept_check old_concept_pass PASSED
concept_check stl_concept_check PASSED
concept_check usage_fail PASSED
concept_check where PASSED
concept_check where_fail PASSED
concept_check stl_concept_covering FAILED
config abi_test PASSED
config boost_fallthrough_test PASSED
config config_info PASSED
config config_info_threaded PASSED
config config_link_test PASSED
config config_test PASSED
config config_test_c PASSED
config config_test_threaded PASSED
config limits_test PASSED
config math_info PASSED
config test_thread_fail1 PASSED
config test_thread_fail2 PASSED
config no_std_wstreambuf_fail FAILED
config no_std_wstreambuf_pass FAILED
container allocator_traits_test PASSED
container deque_test PASSED
container doc_emplace PASSED
container doc_move_containers PASSED
container doc_recursive_containers PASSED
container doc_type_erasure PASSED
container flat_tree_test PASSED
container list_test PASSED
container pair_test PASSED
container scoped_allocator_adaptor_test PASSED
container scoped_allocator_usage_test PASSED
container slist_test PASSED
container stable_vector_test PASSED
container static_vector_test PASSED
container string_test PASSED
container throw_exception_test PASSED
container tree_test PASSED
container vector_test PASSED
context test_context FAILED
conversion args_to_numbers PASSED
conversion cast_test PASSED
conversion generic_stringize PASSED
conversion implicit_cast PASSED
conversion implicit_cast_fail PASSED
conversion lexical_cast_abstract_test PASSED
conversion lexical_cast_arrays_test PASSED
conversion lexical_cast_containers_test PASSED
conversion lexical_cast_empty_input_test PASSED
conversion lexical_cast_filesystem_test PASSED
conversion lexical_cast_inf_nan_test PASSED
conversion lexical_cast_integral_types_test PASSED
conversion lexical_cast_iterator_range_test PASSED
conversion lexical_cast_loopback_test PASSED
conversion lexical_cast_no_exceptions_test PASSED
conversion lexical_cast_no_locale_test PASSED
conversion lexical_cast_noncopyable_test PASSED
conversion lexical_cast_pointers_test PASSED
conversion lexical_cast_stream_detection_test PASSED
conversion lexical_cast_stream_traits_test PASSED
conversion lexical_cast_test PASSED
conversion lexical_cast_to_pointer_test PASSED
conversion lexical_cast_typedefed_wchar_test PASSED
conversion lexical_cast_typedefed_wchar_test_runtime PASSED
conversion lexical_cast_vc8_bug_test PASSED
conversion lexical_cast_wchars_test PASSED
conversion numeric_cast_test PASSED
conversion small_examples PASSED
conversion variant_to_long_double PASSED
conversion lexical_cast_float_types_test FAILED
coroutine test_coroutine FAILED
crc crc_test PASSED
date_time testc_local_adjustor PASSED
date_time testclock PASSED
date_time testclocks PASSED
date_time testconstrained_value PASSED
date_time testcustom_time_zone PASSED
date_time testdate PASSED
date_time testdate_dll PASSED
date_time testdate_duration PASSED
date_time testdate_duration_dll PASSED
date_time testdate_facet_new PASSED
date_time testdate_facet_new_dll PASSED
date_time testdate_input_facet PASSED
date_time testdate_input_facet_dll PASSED
date_time testdate_iterator PASSED
date_time testdate_iterator_dll PASSED
date_time testdst_rules PASSED
date_time testdst_transition_day_rule PASSED
date_time testduration PASSED
date_time testfacet PASSED
date_time testfacet_dll PASSED
date_time testfiletime_functions PASSED
date_time testformatters PASSED
date_time testformatters_dll PASSED
date_time testgenerators PASSED
date_time testgenerators_dll PASSED
date_time testgeneric_period PASSED
date_time testgreg_cal PASSED
date_time testgreg_cal_dll PASSED
date_time testgreg_day PASSED
date_time testgreg_day_dll PASSED
date_time testgreg_duration_operators PASSED
date_time testgreg_durations PASSED
date_time testgreg_durations_dll PASSED
date_time testgreg_month PASSED
date_time testgreg_month_dll PASSED
date_time testgreg_serialize PASSED
date_time testgreg_serialize_dll PASSED
date_time testgreg_serialize_xml PASSED
date_time testgreg_wstream PASSED
date_time testgreg_year PASSED
date_time testgreg_year_dll PASSED
date_time testgregorian_calendar PASSED
date_time testint_adapter PASSED
date_time testiterator PASSED
date_time testlocal_adjustor PASSED
date_time testlocal_time PASSED
date_time testlocal_time_input_facet PASSED
date_time testlocal_time_iterator PASSED
date_time testlocal_time_period PASSED
date_time testmicrosec_time_clock PASSED
date_time testparse_date PASSED
date_time testparse_time PASSED
date_time testperiod PASSED
date_time testperiod_dll PASSED
date_time testposix_time_zone PASSED
date_time teststreams PASSED
date_time testtime PASSED
date_time testtime_facet PASSED
date_time testtime_formatters PASSED
date_time testtime_input_facet PASSED
date_time testtime_period PASSED
date_time testtime_resolution_traits PASSED
date_time testtime_serialize PASSED
date_time testtime_serialize_std_config PASSED
date_time testtime_serialize_xml PASSED
date_time testtime_serialize_xml_std_config PASSED
date_time testtime_wstream PASSED
date_time testwcustom_time_zone PASSED
date_time testwposix_time_zone PASSED
date_time testwrapping_int PASSED
date_time testlocal_time_facet FAILED
date_time testtz_database FAILED
detail container_fwd PASSED
detail container_fwd_debug PASSED
detail container_no_fwd_test PASSED
detail correctly_disable PASSED
detail correctly_disable_debug PASSED
detail is_sorted_test PASSED
disjoint_sets disjoint_set_test PASSED
dynamic_bitset dyn_bitset_unit_tests1 PASSED
dynamic_bitset dyn_bitset_unit_tests2 PASSED
dynamic_bitset dyn_bitset_unit_tests3 PASSED
dynamic_bitset dyn_bitset_unit_tests4 PASSED
exception 1-throw_exception_test PASSED
exception 2-throw_exception_no_exceptions_test PASSED
exception 3-throw_exception_no_integration_test PASSED
exception 4-throw_exception_no_both_test PASSED
exception all_hpp_test PASSED
exception cloning_test PASSED
exception copy_exception_test PASSED
exception current_exception_cast_hpp_test PASSED
exception current_exception_cast_test PASSED
exception diagnostic_information_hpp_test PASSED
exception diagnostic_information_test PASSED
exception enable_error_info_test PASSED
exception errinfo_api_function_hpp_test PASSED
exception errinfo_at_line_hpp_test PASSED
exception errinfo_errno_hpp_test PASSED
exception errinfo_file_handle_hpp_test PASSED
exception errinfo_file_name_hpp_test PASSED
exception errinfo_file_open_mode_hpp_test PASSED
exception errinfo_nested_exception_hpp_test PASSED
exception errinfo_type_info_name_hpp_test PASSED
exception errinfos_test PASSED
exception errno_test PASSED
exception error_info_const_fail PASSED
exception error_info_hpp_test PASSED
exception error_info_test PASSED
exception exception_fail PASSED
exception exception_ptr_hpp_test PASSED
exception exception_ptr_test PASSED
exception exception_test PASSED
exception get_error_info_hpp_test PASSED
exception has_to_string_test PASSED
exception info_hpp_test PASSED
exception info_tuple_hpp_test PASSED
exception is_output_streamable_test PASSED
exception no_exceptions_test PASSED
exception non_intrusive_exception_ptr_test PASSED
exception refcount_ptr_test PASSED
exception throw_exception_fail PASSED
exception throw_exception_test PASSED
exception to_string_fail PASSED
exception to_string_hpp_test PASSED
exception to_string_stub_hpp_test PASSED
exception to_string_stub_test PASSED
exception to_string_test PASSED
exception unknown_exception_test PASSED
filesystem convenience_test PASSED
filesystem deprecated_test PASSED
filesystem file_status PASSED
filesystem locale_info PASSED
filesystem macro_default_test PASSED
filesystem operations_unit_test PASSED
filesystem path_test PASSED
filesystem path_test_static PASSED
filesystem path_unit_test PASSED
filesystem path_unit_test_static PASSED
filesystem simple_ls PASSED
filesystem fstream_test FAILED
filesystem large_file_support_test FAILED
filesystem operations_test FAILED
filesystem operations_test_static FAILED
flyweight test_assoc_cont_factory PASSED
flyweight test_basic PASSED
flyweight test_custom_factory PASSED
flyweight test_init PASSED
flyweight test_intermod_holder PASSED
flyweight test_multictor PASSED
flyweight test_no_locking PASSED
flyweight test_no_tracking PASSED
flyweight test_set_factory PASSED
foreach array_byref PASSED
foreach array_byref_r PASSED
foreach array_byval PASSED
foreach array_byval_r PASSED
foreach call_once PASSED
foreach cstr_byref PASSED
foreach cstr_byref_r PASSED
foreach cstr_byval PASSED
foreach cstr_byval_r PASSED
foreach dependent_type PASSED
foreach misc PASSED
foreach noncopyable PASSED
foreach pair_byref PASSED
foreach pair_byref_r PASSED
foreach pair_byval PASSED
foreach pair_byval_r PASSED
foreach rvalue_const PASSED
foreach rvalue_const_r PASSED
foreach rvalue_nonconst PASSED
foreach rvalue_nonconst_r PASSED
foreach stl_byref PASSED
foreach stl_byref_r PASSED
foreach stl_byval PASSED
foreach stl_byval_r PASSED
foreach user_defined PASSED
format format_test1 PASSED
format format_test2 PASSED
format format_test3 PASSED
format format_test_enum PASSED
format format_test_wstring PASSED
function allocator_test PASSED
function contains2_test PASSED
function contains_test PASSED
function function_30 PASSED
function function_arith_cxx98 PASSED
function function_arith_portable PASSED
function function_n_test PASSED
function function_ref_cxx98 PASSED
function function_ref_portable PASSED
function function_test_fail1 PASSED
function function_test_fail2 PASSED
function function_typeof_test PASSED
function lambda_test PASSED
function lib_function_test PASSED
function mem_fun_cxx98 PASSED
function mem_fun_portable PASSED
function nothrow_swap PASSED
function stateless_test PASSED
function std_bind_cxx98 PASSED
function std_bind_portable PASSED
function sum_avg_cxx98 PASSED
function sum_avg_portable PASSED
function_types cc_preprocessing PASSED
function_types class_type_transform PASSED
function_types components PASSED
function_types components_seq PASSED
function_types fast_mem_fn_example PASSED
function_types function_arity PASSED
function_types function_arity_fail PASSED
function_types function_pointer PASSED
function_types function_reference PASSED
function_types function_type PASSED
function_types interface_example PASSED
function_types interpreter_example PASSED
function_types is_callable_builtin PASSED
function_types is_cv_mem_func_ptr PASSED
function_types is_cv_pointer PASSED
function_types is_function PASSED
function_types is_function_pointer PASSED
function_types is_function_reference PASSED
function_types is_member_function_pointer PASSED
function_types is_member_object_pointer PASSED
function_types is_member_pointer PASSED
function_types is_nonmember_callable_builtin PASSED
function_types is_variadic PASSED
function_types macro_type_args_example PASSED
function_types mem_func_ptr_cv1 PASSED
function_types mem_func_ptr_cv2 PASSED
function_types mem_func_ptr_cv_ptr_to_this PASSED
function_types member_function_pointer PASSED
function_types member_object_pointer PASSED
function_types parameter_types PASSED
function_types parameter_types_fail PASSED
function_types partial_arity_preprocessing PASSED
function_types preprocessing_mode PASSED
function_types result_of_example PASSED
function_types result_type PASSED
function_types result_type_fail PASSED
function_types transformation PASSED
function_types variadic_function_synthesis PASSED
functional books PASSED
functional check_float_funcs PASSED
functional extensions_hpp_test PASSED
functional factory PASSED
functional factory_with_allocator PASSED
functional forward_adapter PASSED
functional function_test PASSED
functional functor PASSED
functional hash_built_in_array_test PASSED
functional hash_complex_test PASSED
functional hash_custom_test PASSED
functional hash_deque_test PASSED
functional hash_enum_test PASSED
functional hash_float_test PASSED
functional hash_friend_test PASSED
functional hash_function_pointer_test PASSED
functional hash_fwd_test_1 PASSED
functional hash_fwd_test_2 PASSED
functional hash_global_namespace_test PASSED
functional hash_list_test PASSED
functional hash_long_double_test PASSED
functional hash_map_test PASSED
functional hash_no_ext_fail_test PASSED
functional hash_no_ext_macro_1 PASSED
functional hash_no_ext_macro_2 PASSED
functional hash_number_test PASSED
functional hash_pointer_test PASSED
functional hash_range_test PASSED
functional hash_set_test PASSED
functional hash_std_array_test PASSED
functional hash_std_smart_ptr_test PASSED
functional hash_std_tuple_test PASSED
functional hash_string_test PASSED
functional hash_type_index_test PASSED
functional hash_value_array_test PASSED
functional hash_vector_test PASSED
functional implicit_test PASSED
functional lightweight_forward_adapter PASSED
functional link_ext_test PASSED
functional link_test PASSED
functional make_call PASSED
functional make_decl PASSED
functional namespace_fail_test PASSED
functional no_ext_float_test PASSED
functional no_ext_function_pointer_test PASSED
functional no_ext_link_test PASSED
functional no_ext_long_double_test PASSED
functional no_ext_number_test PASSED
functional no_ext_pointer_test PASSED
functional no_ext_string_test PASSED
functional point PASSED
functional portable PASSED
functional template PASSED
functional value_factory PASSED
fusion adapt_adt PASSED
fusion adapt_adt_named PASSED
fusion adapt_assoc_adt PASSED
fusion adapt_assoc_adt_named PASSED
fusion adapt_assoc_struct PASSED
fusion adapt_assoc_struct_named PASSED
fusion adapt_assoc_tpl_adt PASSED
fusion adapt_assoc_tpl_struct PASSED
fusion adapt_struct PASSED
fusion adapt_struct_named PASSED
fusion adapt_tpl_adt PASSED
fusion adapt_tpl_struct PASSED
fusion adt_attribute_proxy PASSED
fusion all PASSED
fusion any PASSED
fusion array PASSED
fusion as_list PASSED
fusion as_map PASSED
fusion as_set PASSED
fusion as_vector PASSED
fusion back_extended_deque PASSED
fusion boost_array PASSED
fusion boost_tuple PASSED
fusion clear PASSED
fusion cons PASSED
fusion copy PASSED
fusion count PASSED
fusion count_if PASSED
fusion deduce_sequence PASSED
fusion define_assoc_struct PASSED
fusion define_assoc_tpl_struct PASSED
fusion define_struct PASSED
fusion define_tpl_struct PASSED
fusion deque_comparison PASSED
fusion deque_construction PASSED
fusion deque_copy PASSED
fusion deque_iterator PASSED
fusion deque_make PASSED
fusion deque_misc PASSED
fusion deque_move PASSED
fusion deque_mutate PASSED
fusion deque_tie PASSED
fusion deque_value_at PASSED
fusion erase PASSED
fusion erase_key PASSED
fusion filter PASSED
fusion filter_if PASSED
fusion filter_view PASSED
fusion find PASSED
fusion find_if PASSED
fusion fold PASSED
fusion fold2 PASSED
fusion for_each PASSED
fusion front_extended_deque PASSED
fusion fused PASSED
fusion fused_function_object PASSED
fusion fused_procedure PASSED
fusion insert PASSED
fusion insert_range PASSED
fusion invoke PASSED
fusion invoke_function_object PASSED
fusion invoke_procedure PASSED
fusion io PASSED
fusion iter_fold PASSED
fusion iterator_range PASSED
fusion join PASSED
fusion joint_view PASSED
fusion list_comparison PASSED
fusion list_construction PASSED
fusion list_copy PASSED
fusion list_iterator PASSED
fusion list_make PASSED
fusion list_misc PASSED
fusion list_mutate PASSED
fusion list_tie PASSED
fusion list_value_at PASSED
fusion make_fused PASSED
fusion make_fused_function_object PASSED
fusion make_fused_procedure PASSED
fusion make_list PASSED
fusion make_unfused PASSED
fusion make_vector PASSED
fusion map PASSED
fusion map_tie PASSED
fusion none PASSED
fusion nview PASSED
fusion pop_back PASSED
fusion pop_front PASSED
fusion push_back PASSED
fusion push_front PASSED
fusion remove PASSED
fusion remove_if PASSED
fusion repetitive_view PASSED
fusion replace PASSED
fusion replace_if PASSED
fusion reverse PASSED
fusion reverse_fold PASSED
fusion reverse_iter_fold PASSED
fusion reverse_view PASSED
fusion segmented_find PASSED
fusion segmented_find_if PASSED
fusion segmented_fold PASSED
fusion segmented_for_each PASSED
fusion segmented_iterator_range PASSED
fusion set PASSED
fusion single_view PASSED
fusion std_pair PASSED
fusion std_tuple_iterator PASSED
fusion swap PASSED
fusion tr1_tuple_auto_conv PASSED
fusion transform PASSED
fusion transform_view PASSED
fusion tuple_comparison PASSED
fusion tuple_construction PASSED
fusion tuple_copy PASSED
fusion tuple_element PASSED
fusion tuple_make PASSED
fusion tuple_misc PASSED
fusion tuple_mutate PASSED
fusion tuple_tie PASSED
fusion unfused PASSED
fusion unfused_typed PASSED
fusion vector_comparison PASSED
fusion vector_construction PASSED
fusion vector_copy PASSED
fusion vector_iterator PASSED
fusion vector_make PASSED
fusion vector_misc PASSED
fusion vector_move PASSED
fusion vector_mutate PASSED
fusion vector_n PASSED
fusion vector_tie PASSED
fusion vector_value_at PASSED
fusion zip PASSED
fusion zip2 PASSED
fusion zip_ignore PASSED
fusion zip_view PASSED
fusion zip_view2 PASSED
fusion zip_view_ignore PASSED
geometry access PASSED
geometry adapted PASSED
geometry append PASSED
geometry area PASSED
geometry arithmetic PASSED
geometry array_point PASSED
geometry assemble PASSED
geometry assign PASSED
geometry boost_array_as_point PASSED
geometry boost_fusion PASSED
geometry boost_range PASSED
geometry boost_tuple PASSED
geometry box PASSED
geometry box_view PASSED
geometry buffer PASSED
geometry calculation_type PASSED
geometry ccw_traverse PASSED
geometry centroid PASSED
geometry closeable_view PASSED
geometry closing_iterator PASSED
geometry comparable_distance PASSED
geometry compare PASSED
geometry concept_checker PASSED
geometry convert PASSED
geometry convex_hull PASSED
geometry coordinate_dimension PASSED
geometry coordinate_system PASSED
geometry coordinate_type PASSED
geometry correct PASSED
geometry covered_by PASSED
geometry cross_track PASSED
geometry custom_linestring PASSED
geometry disjoint PASSED
geometry distance PASSED
geometry dot_product PASSED
geometry dsv PASSED
geometry envelope PASSED
geometry equals PASSED
geometry ever_circling_iterator PASSED
geometry expand PASSED
geometry for_each PASSED
geometry for_each_coordinate PASSED
geometry geometry_id PASSED
geometry get_turn_info PASSED
geometry get_turns PASSED
geometry haversine PASSED
geometry intersects PASSED
geometry length PASSED
geometry make PASSED
geometry multi_area PASSED
geometry multi_centroid PASSED
geometry multi_convert PASSED
geometry multi_convex_hull PASSED
geometry multi_correct PASSED
geometry multi_covered_by PASSED
geometry multi_difference_spike PASSED
geometry multi_disjoint PASSED
geometry multi_distance PASSED
geometry multi_envelope PASSED
geometry multi_equals PASSED
geometry multi_for_each PASSED
geometry multi_intersection PASSED
geometry multi_intersects PASSED
geometry multi_length PASSED
geometry multi_num_geometries PASSED
geometry multi_num_interior_rings PASSED
geometry multi_num_points PASSED
geometry multi_perimeter PASSED
geometry multi_reverse PASSED
geometry multi_simplify PASSED
geometry multi_touches PASSED
geometry multi_transform PASSED
geometry multi_traverse PASSED
geometry multi_union PASSED
geometry multi_unique PASSED
geometry multi_within PASSED
geometry overlaps PASSED
geometry partition PASSED
geometry perimeter PASSED
geometry point_type PASSED
geometry point_with_incorrect_dimension PASSED
geometry point_without_coordinate_type PASSED
geometry point_without_dimension PASSED
geometry point_without_getter PASSED
geometry point_without_setter PASSED
geometry projected_point PASSED
geometry radian_access PASSED
geometry range_by_section PASSED
geometry rational PASSED
geometry relative_order PASSED
geometry reverse PASSED
geometry reversible_closeable PASSED
geometry reversible_view PASSED
geometry ring PASSED
geometry sectionalize PASSED
geometry segment PASSED
geometry segment_view PASSED
geometry select_rings PASSED
geometry self_intersection_points PASSED
geometry simplify PASSED
geometry spherical_side PASSED
geometry tag PASSED
geometry topological_dimension PASSED
geometry touches PASSED
geometry transform PASSED
geometry transform_cs PASSED
geometry transformer PASSED
geometry unique PASSED
geometry well_formed_point PASSED
geometry well_formed_point_traits PASSED
geometry within PASSED
geometry wkt PASSED
geometry write_dsv PASSED
geometry difference FAILED
geometry intersection FAILED
geometry multi_difference FAILED
geometry pythagoras FAILED
geometry select_most_precise FAILED
geometry traverse FAILED
geometry union FAILED
gil channel PASSED
gil image_io PASSED
gil pixel PASSED
gil pixel_iterator PASSED
gil image FAILED
graph adj_list_cc PASSED
graph adj_list_edge_list_set PASSED
graph adj_list_loops PASSED
graph adj_matrix_cc PASSED
graph adjacency_matrix_test PASSED
graph all_planar_input_files_test PASSED
graph astar_search_test PASSED
graph basic_planarity_test PASSED
graph bellman-test PASSED
graph betweenness_centrality_test PASSED
graph bfs PASSED
graph bfs_cc PASSED
graph biconnected_components_test PASSED
graph bidir_remove_edge PASSED
graph bipartite_test PASSED
graph boykov_kolmogorov_max_flow_test PASSED
graph bron_kerbosch_all_cliques PASSED
graph bundled_properties PASSED
graph closeness_centrality PASSED
graph clustering_coefficient PASSED
graph copy PASSED
graph core_numbers_test PASSED
graph csr_graph_test PASSED
graph cuthill_mckee_ordering PASSED
graph cycle_canceling_test PASSED
graph cycle_ratio_tests PASSED
graph dag_longest_paths PASSED
graph degree_centrality PASSED
graph dfs PASSED
graph dfs_cc PASSED
graph dijkstra_cc PASSED
graph dijkstra_heap_performance PASSED
graph dijkstra_no_color_map_compare PASSED
graph dimacs PASSED
graph dominator_tree_test PASSED
graph eccentricity PASSED
graph edge_list_cc PASSED
graph filtered_graph_cc PASSED
graph filtered_graph_properties_dijkstra PASSED
graph floyd_warshall_test PASSED
graph generator_test PASSED
graph graph PASSED
graph graph_concepts PASSED
graph graphml_test PASSED
graph graphviz_test PASSED
graph grid_graph_cc PASSED
graph grid_graph_test PASSED
graph gursoy_atun_layout_test PASSED
graph hawick_circuits PASSED
graph incremental_components_test PASSED
graph index_graph PASSED
graph is_straight_line_draw_test PASSED
graph isomorphism PASSED
graph king_ordering PASSED
graph labeled_graph PASSED
graph layout_test PASSED
graph make_bicon_planar_test PASSED
graph make_connected_test PASSED
graph make_maximal_planar_test PASSED
graph mas_test PASSED
graph matching_test PASSED
graph max_flow_test PASSED
graph mcgregor_subgraphs_test PASSED
graph mean_geodesic PASSED
graph metis_test PASSED
graph metric_tsp_approx PASSED
graph named_vertices_test PASSED
graph parallel_edges_loops_test PASSED
graph property_iter PASSED
graph r_c_shortest_paths_test PASSED
graph random_spanning_tree_test PASSED
graph rcsp_custom_vertex_id PASSED
graph read_propmap PASSED
graph relaxed_heap_test PASSED
graph reverse_graph_cc PASSED
graph sequential_vertex_coloring PASSED
graph serialize PASSED
graph stoer_wagner_test PASSED
graph subgraph PASSED
graph subgraph_bundled PASSED
graph subgraph_props PASSED
graph successive_shortest_path_nonnegative_weights_test PASSED
graph test_graphs PASSED
graph tiernan_all_cycles PASSED
graph transitive_closure_test PASSED
graph two_graphs_common_spanning_trees_test PASSED
graph undirected_dfs PASSED
graph vector_graph_cc PASSED
graph vf2_sub_graph_iso_test PASSED
heap binomial_heap_test FAILED
heap d_ary_heap_test FAILED
heap fibonacci_heap_test FAILED
heap mutable_heap_test FAILED
heap pairing_heap_tests FAILED
heap priority_queue_test FAILED
heap skew_heap_test FAILED
icl chrono_icl_interval PASSED
icl chrono_icl_map PASSED
icl chrono_interval_map PASSED
icl chrono_interval_map_infix PASSED
icl chrono_interval_map_mixed PASSED
icl chrono_interval_map_mixed2 PASSED
icl chrono_interval_set PASSED
icl chrono_interval_set_infix PASSED
icl chrono_interval_set_mixed PASSED
icl chrono_partial_icl_quantifier PASSED
icl chrono_partial_interval_quantifier PASSED
icl chrono_set_icl_set PASSED
icl chrono_set_interval_set PASSED
icl chrono_total_icl_quantifier PASSED
icl chrono_total_interval_quantifier PASSED
icl cmp_clang_ttp_passing PASSED
icl cmp_clang_ttp_passing2 PASSED
icl cmp_msvc_value_born_error PASSED
icl ex_boost_party PASSED
icl fastest_icl_map PASSED
icl fastest_set_icl_set PASSED
icl fix_icl_after_thread PASSED
icl fix_tickets PASSED
icl interval_map_left_open PASSED
icl interval_map_right_open PASSED
icl test_changing_interval_defaults PASSED
icl test_type_traits PASSED
icl chrono_interval_map_infix_mixed FAILED
icl fastest_icl_interval FAILED
icl fastest_interval_map FAILED
icl fastest_interval_map_infix FAILED
icl fastest_interval_map_infix_mixed FAILED
icl fastest_interval_map_mixed FAILED
icl fastest_interval_map_mixed2 FAILED
icl fastest_interval_set FAILED
icl fastest_interval_set_infix FAILED
icl fastest_interval_set_mixed FAILED
icl fastest_partial_icl_quantifier FAILED
icl fastest_partial_interval_quantifier FAILED
icl fastest_separate_interval_set FAILED
icl fastest_separate_interval_set_infix FAILED
icl fastest_set_interval_set FAILED
icl fastest_split_interval_map FAILED
icl fastest_split_interval_map_infix FAILED
icl fastest_split_interval_set FAILED
icl fastest_split_interval_set_infix FAILED
icl fastest_total_icl_quantifier FAILED
icl fastest_total_interval_quantifier FAILED
icl test_doc_code FAILED
icl test_misc FAILED
integer cstdint_include_test PASSED
integer cstdint_test PASSED
integer cstdint_test2 PASSED
integer fail_int_exact PASSED
integer fail_int_fast PASSED
integer fail_int_least PASSED
integer fail_uint_exact PASSED
integer fail_uint_fast PASSED
integer fail_uint_least PASSED
integer integer_fwd_include_test PASSED
integer integer_include_test PASSED
integer integer_mask_include_test PASSED
integer integer_mask_test PASSED
integer integer_test PASSED
integer integer_traits_include_test PASSED
integer integer_traits_test PASSED
integer static_log2_include_test PASSED
integer static_log2_test PASSED
integer static_min_max_include_test PASSED
integer static_min_max_test PASSED
interprocess adaptive_node_pool_test PASSED
interprocess adaptive_pool_test PASSED
interprocess allocexcept_test PASSED
interprocess anonymous_shared_memory_test PASSED
interprocess bufferstream_test PASSED
interprocess cached_adaptive_pool_test PASSED
interprocess cached_node_allocator_test PASSED
interprocess comp_doc_anonymous_conditionA PASSED
interprocess comp_doc_anonymous_conditionB PASSED
interprocess comp_doc_anonymous_mutexA PASSED
interprocess comp_doc_anonymous_mutexB PASSED
interprocess comp_doc_anonymous_semaphoreA PASSED
interprocess comp_doc_anonymous_semaphoreB PASSED
interprocess comp_doc_anonymous_upgradable_mutexA PASSED
interprocess comp_doc_anonymous_upgradable_mutexB PASSED
interprocess comp_doc_message_queueA PASSED
interprocess comp_doc_message_queueB PASSED
interprocess condition_any_test PASSED
interprocess condition_test PASSED
interprocess data_test PASSED
interprocess deque_test PASSED
interprocess doc_adaptive_pool PASSED
interprocess doc_allocator PASSED
interprocess doc_anonymous_shared_memory PASSED
interprocess doc_bufferstream PASSED
interprocess doc_cached_adaptive_pool PASSED
interprocess doc_cached_node_allocator PASSED
interprocess doc_complex_map PASSED
interprocess doc_cont PASSED
interprocess doc_file_mapping PASSED
interprocess doc_intrusive PASSED
interprocess doc_ipc_message PASSED
interprocess doc_managed_aligned_allocation PASSED
interprocess doc_managed_allocation_command PASSED
interprocess doc_managed_construction_info PASSED
interprocess doc_managed_copy_on_write PASSED
interprocess doc_managed_external_buffer PASSED
interprocess doc_managed_grow PASSED
interprocess doc_managed_heap_memory PASSED
interprocess doc_managed_mapped_file PASSED
interprocess doc_managed_multiple_allocation PASSED
interprocess doc_managed_raw_allocation PASSED
interprocess doc_map PASSED
interprocess doc_move_containers PASSED
interprocess doc_multi_index PASSED
interprocess doc_named_alloc PASSED
interprocess doc_named_mutex PASSED
interprocess doc_node_allocator PASSED
interprocess doc_offset_ptr PASSED
interprocess doc_private_adaptive_pool PASSED
interprocess doc_private_node_allocator PASSED
interprocess doc_scoped_ptr PASSED
interprocess doc_shared_memory PASSED
interprocess doc_shared_ptr PASSED
interprocess doc_shared_ptr_explicit PASSED
interprocess doc_spawn_vector PASSED
interprocess doc_unique_ptr PASSED
interprocess doc_unordered_map PASSED
interprocess doc_vectorstream PASSED
interprocess doc_where_allocate PASSED
interprocess doc_windows_shared_memory PASSED
interprocess doc_xsi_shared_memory PASSED
interprocess enable_shared_from_this_test PASSED
interprocess file_lock_test PASSED
interprocess file_mapping_test PASSED
interprocess flat_map_index_allocation_test PASSED
interprocess flat_tree_test PASSED
interprocess intermodule_singleton_test PASSED
interprocess intersegment_ptr_test PASSED
interprocess intrusive_ptr_test PASSED
interprocess iset_index_allocation_test PASSED
interprocess iunordered_set_index_allocation_test PASSED
interprocess list_test PASSED
interprocess managed_mapped_file_test PASSED
interprocess managed_shared_memory_test PASSED
interprocess managed_windows_shared_memory_test PASSED
interprocess managed_xsi_shared_memory_test PASSED
interprocess map_index_allocation_test PASSED
interprocess mapped_file_test PASSED
interprocess memory_algorithm_test PASSED
interprocess message_queue_test PASSED
interprocess multi_index_test PASSED
interprocess mutex_test PASSED
interprocess mutex_timeout_test PASSED
interprocess named_condition_any_test PASSED
interprocess named_condition_test PASSED
interprocess named_construct_test PASSED
interprocess named_mutex_test PASSED
interprocess named_recursive_mutex_test PASSED
interprocess named_semaphore_test PASSED
interprocess node_allocator_test PASSED
interprocess node_pool_test PASSED
interprocess null_index_test PASSED
interprocess offset_ptr_test PASSED
interprocess private_adaptive_pool_test PASSED
interprocess private_node_allocator_test PASSED
interprocess recursive_mutex_test PASSED
interprocess robust_emulation_test PASSED
interprocess robust_recursive_emulation_test PASSED
interprocess semaphore_test PASSED
interprocess sharable_mutex_test PASSED
interprocess shared_memory_mapping_test PASSED
interprocess shared_memory_test PASSED
interprocess slist_test PASSED
interprocess stable_vector_test PASSED
interprocess string_test PASSED
interprocess tree_test PASSED
interprocess unique_ptr_test PASSED
interprocess unordered_test PASSED
interprocess upgradable_mutex_test PASSED
interprocess user_buffer_test PASSED
interprocess vector_test PASSED
interprocess vectorstream_test PASSED
interprocess windows_shared_memory_mapping_test PASSED
interprocess windows_shared_memory_test PASSED
interprocess xsi_shared_memory_mapping_test PASSED
interprocess named_sharable_mutex_test FAILED
interprocess named_upgradable_mutex_test FAILED
interprocess shared_ptr_test FAILED
intrusive any_test PASSED
intrusive avl_multiset_test PASSED
intrusive avl_set_test PASSED
intrusive custom_bucket_traits_test PASSED
intrusive default_hook_test PASSED
intrusive doc_advanced_value_traits PASSED
intrusive doc_advanced_value_traits2 PASSED
intrusive doc_any_hook PASSED
intrusive doc_assoc_optimized_code PASSED
intrusive doc_auto_unlink PASSED
intrusive doc_avl_set PASSED
intrusive doc_avltree_algorithms PASSED
intrusive doc_bucket_traits PASSED
intrusive doc_clone_from PASSED
intrusive doc_entity PASSED
intrusive doc_erasing_and_disposing PASSED
intrusive doc_external_value_traits PASSED
intrusive doc_function_hooks PASSED
intrusive doc_how_to_use PASSED
intrusive doc_iterator_from_value PASSED
intrusive doc_list PASSED
intrusive doc_list_algorithms PASSED
intrusive doc_offset_ptr PASSED
intrusive doc_positional_insertion PASSED
intrusive doc_rbtree_algorithms PASSED
intrusive doc_recursive PASSED
intrusive doc_recursive_member PASSED
intrusive doc_set PASSED
intrusive doc_sg_set PASSED
intrusive doc_slist PASSED
intrusive doc_slist_algorithms PASSED
intrusive doc_splay_algorithms PASSED
intrusive doc_splay_set PASSED
intrusive doc_splaytree_algorithms PASSED
intrusive doc_stateful_value_traits PASSED
intrusive doc_treap_algorithms PASSED
intrusive doc_treap_set PASSED
intrusive doc_unordered_set PASSED
intrusive doc_value_traits PASSED
intrusive doc_window PASSED
intrusive external_value_traits_test PASSED
intrusive function_hook_test PASSED
intrusive list_test PASSED
intrusive make_functions_test PASSED
intrusive multiset_test PASSED
intrusive pointer_traits_test PASSED
intrusive recursive_test PASSED
intrusive scary_iterators_test PASSED
intrusive set_test PASSED
intrusive sg_multiset_test PASSED
intrusive sg_set_test PASSED
intrusive slist_test PASSED
intrusive splay_multiset_test PASSED
intrusive splay_set_test PASSED
intrusive stateful_value_traits_test PASSED
intrusive treap_multiset_test PASSED
intrusive treap_set_test PASSED
intrusive unordered_multiset_test PASSED
intrusive unordered_set_test PASSED
intrusive virtual_base_test PASSED
intrusive has_member_function_callable_with FAILED
io ios_state_test PASSED
io ios_state_unit_test PASSED
io quoted_manip_test PASSED
iostreams array_test PASSED
iostreams auto_close_test PASSED
iostreams buffer_size_test PASSED
iostreams bzip2_test PASSED
iostreams close_test PASSED
iostreams code_converter_test PASSED
iostreams combine_test PASSED
iostreams component_access_test PASSED
iostreams compose_test PASSED
iostreams copy_test PASSED
iostreams counter_test PASSED
iostreams deprecated_file_descriptor_fail PASSED
iostreams deprecated_file_descriptor_test PASSED
iostreams direct_adapter_test PASSED
iostreams example_test PASSED
iostreams execute_test PASSED
iostreams file_descriptor_test PASSED
iostreams file_test PASSED
iostreams filtering_stream_test PASSED
iostreams finite_state_filter_test PASSED
iostreams flush_test PASSED
iostreams grep_test PASSED
iostreams gzip_test PASSED
iostreams invert_test PASSED
iostreams line_filter_test PASSED
iostreams mapped_file_test PASSED
iostreams newline_test PASSED
iostreams null_test PASSED
iostreams operation_sequence_test PASSED
iostreams path_test PASSED
iostreams pipeline_test PASSED
iostreams regex_filter_test PASSED
iostreams restrict_test PASSED
iostreams seekable_file_test PASSED
iostreams seekable_filter_test PASSED
iostreams sequence_test PASSED
iostreams slice_test PASSED
iostreams stdio_filter_test PASSED
iostreams stream_offset_32bit_test PASSED
iostreams symmetric_filter_test PASSED
iostreams tee_test PASSED
iostreams wide_stream_test PASSED
iostreams zlib_test PASSED
iostreams stream_offset_64bit_test FAILED
iterator concept_tests PASSED
iterator counting_iterator_test PASSED
iterator filter_iterator_test PASSED
iterator function_input_iterator_test PASSED
iterator indirect_iter_member_types PASSED
iterator indirect_iterator_test PASSED
iterator interoperable PASSED
iterator interoperable_fail PASSED
iterator is_convertible_fail PASSED
iterator is_lvalue_iterator PASSED
iterator is_readable_iterator PASSED
iterator iter_archetype_default_ctor PASSED
iterator iterator_adaptor_cc PASSED
iterator iterator_adaptor_test PASSED
iterator iterator_archetype_cc PASSED
iterator iterator_facade PASSED
iterator iterator_traits_test PASSED
iterator lvalue_concept_fail PASSED
iterator permutation_iterator_test PASSED
iterator pointee PASSED
iterator reverse_iterator_test PASSED
iterator transform_iterator_test PASSED
iterator unit_tests PASSED
iterator zip_iterator_test PASSED
lambda algorithm_test PASSED
lambda bind_tests_advanced PASSED
lambda bind_tests_simple PASSED
lambda bind_tests_simple_f_refs PASSED
lambda bll_and_function PASSED
lambda constructor_tests PASSED
lambda control_structures PASSED
lambda exception_test PASSED
lambda extending_rt_traits PASSED
lambda is_instance_of_test PASSED
lambda lambda_cast_test PASSED
lambda member_pointer_test PASSED
lambda operator_tests_simple PASSED
lambda phoenix_control_structures PASSED
lambda result_of_tests PASSED
lambda ret_test PASSED
lambda switch_construct PASSED
local_function add PASSED
local_function add_classifiers PASSED
local_function add_classifiers_seq PASSED
local_function add_classifiers_seq_nova PASSED
local_function add_default PASSED
local_function add_default_seq PASSED
local_function add_default_seq_nova PASSED
local_function add_except PASSED
local_function add_except_seq PASSED
local_function add_except_seq_nova PASSED
local_function add_inline PASSED
local_function add_inline_seq PASSED
local_function add_inline_seq_nova PASSED
local_function add_params_only PASSED
local_function add_params_only_seq PASSED
local_function add_params_only_seq_nova PASSED
local_function add_seq PASSED
local_function add_seq_nova PASSED
local_function add_template PASSED
local_function add_template_seq PASSED
local_function add_template_seq_nova PASSED
local_function add_this PASSED
local_function add_this_seq PASSED
local_function add_this_seq_nova PASSED
local_function add_typed PASSED
local_function add_typed_seq PASSED
local_function add_typed_seq_nova PASSED
local_function add_with_default PASSED
local_function add_with_default_seq PASSED
local_function add_with_default_seq_nova PASSED
local_function all_decl PASSED
local_function all_decl_seq PASSED
local_function all_decl_seq_nova PASSED
local_function factorial PASSED
local_function factorial_seq PASSED
local_function factorial_seq_nova PASSED
local_function goto PASSED
local_function goto_error PASSED
local_function goto_error_seq PASSED
local_function goto_error_seq_nova PASSED
local_function goto_seq PASSED
local_function goto_seq_nova PASSED
local_function macro_commas PASSED
local_function macro_commas_seq PASSED
local_function macro_commas_seq_nova PASSED
local_function nesting PASSED
local_function nesting_seq PASSED
local_function nesting_seq_nova PASSED
local_function operator PASSED
local_function operator_error PASSED
local_function operator_error_seq PASSED
local_function operator_error_seq_nova PASSED
local_function operator_seq PASSED
local_function operator_seq_nova PASSED
local_function overload PASSED
local_function overload_seq PASSED
local_function overload_seq_nova PASSED
local_function return_assign PASSED
local_function return_assign_seq PASSED
local_function return_assign_seq_nova PASSED
local_function return_derivative PASSED
local_function return_derivative_seq PASSED
local_function return_derivative_seq_nova PASSED
local_function return_inc PASSED
local_function return_inc_seq PASSED
local_function return_inc_seq_nova PASSED
local_function return_setget PASSED
local_function return_setget_seq PASSED
local_function return_setget_seq_nova PASSED
local_function return_this PASSED
local_function return_this_seq PASSED
local_function return_this_seq_nova PASSED
local_function same_line PASSED
local_function same_line_seq PASSED
local_function same_line_seq_nova PASSED
local_function ten_void PASSED
local_function ten_void_nova PASSED
local_function transform PASSED
local_function transform_seq PASSED
local_function transform_seq_nova PASSED
local_function typeof FAILED
local_function typeof_seq FAILED
local_function typeof_seq_nova FAILED
local_function typeof_template FAILED
local_function typeof_template_seq FAILED
local_function typeof_template_seq_nova FAILED
locale test_boundary PASSED
locale test_collate PASSED
locale test_config PASSED
locale test_convert PASSED
locale test_date_time PASSED
locale test_formatting PASSED
locale test_generator PASSED
locale test_icu_vs_os_timezone PASSED
locale test_ios_prop PASSED
locale test_posix_collate PASSED
locale test_posix_convert PASSED
locale test_posix_formatting PASSED
locale test_std_formatting PASSED
locale test_utf PASSED
locale test_winapi_collate PASSED
locale test_winapi_convert PASSED
locale test_winapi_formatting PASSED
locale test_codepage FAILED
locale test_codepage_converter FAILED
locale test_message FAILED
locale test_std_collate FAILED
locale test_std_convert FAILED
lockfree freelist_test PASSED
lockfree queue_bounded_stress_test PASSED
lockfree queue_fixedsize_stress_test PASSED
lockfree queue_interprocess_test PASSED
lockfree queue_test PASSED
lockfree queue_unbounded_stress_test PASSED
lockfree spsc_queue_stress_test PASSED
lockfree spsc_queue_test PASSED
lockfree stack_bounded_stress_test PASSED
lockfree stack_fixedsize_stress_test PASSED
lockfree stack_interprocess_test PASSED
lockfree stack_test PASSED
lockfree stack_unbounded_stress_test PASSED
lockfree tagged_ptr_test PASSED
log attr_functor_void_return PASSED
log current_function_support PASSED
log util_unique_identifier PASSED
log attr_attribute_set FAILED
log attr_attribute_value_impl FAILED
log attr_attribute_value_set FAILED
log attr_function FAILED
log attr_named_scope FAILED
log attr_value_visitation FAILED
log core FAILED
log filt_attr FAILED
log filt_has_attr FAILED
log form_attr FAILED
log form_date_time FAILED
log form_format FAILED
log form_if FAILED
log form_message FAILED
log form_named_scope FAILED
log src_logger_assignable FAILED
log unhandled_exception_count FAILED
log unhandled_exception_count_np FAILED
log util_dynamic_type_disp FAILED
log util_exception_handler FAILED
log util_formatting_ostream FAILED
log util_manip_dump FAILED
log util_once_block FAILED
log util_static_type_disp FAILED
log util_stp_filter_parser FAILED
log util_stp_formatter_parser FAILED
log util_stp_settings_parser FAILED
log util_string_literal FAILED
log util_type_info_wrapper FAILED
logic tribool_io_test PASSED
logic tribool_rename_test PASSED
logic tribool_test PASSED
math bessel_zeros_example_1 PASSED
math bessel_zeros_interator_example PASSED
math binomial_coinflip_example PASSED
math binomial_confidence_limits PASSED
math binomial_example_nag PASSED
math binomial_quiz_example PASSED
math binomial_sample_sizes PASSED
math c_error_policy_example PASSED
math chi_square_std_dev_test PASSED
math common_factor_test PASSED
math compl_abs_incl_test PASSED
math compl_acos_incl_test PASSED
math compl_acosh_incl_test PASSED
math compl_asin_incl_test PASSED
math compl_asinh_incl_test PASSED
math compl_atan_incl_test PASSED
math compl_atanh_incl_test PASSED
math complex_test PASSED
math constants_eg1 PASSED
math constants_incl_test PASSED
math dist_bernoulli_incl_test PASSED
math dist_beta_incl_test PASSED
math dist_binomial_incl_test PASSED
math dist_cauchy_incl_test PASSED
math dist_chi_squared_incl_test PASSED
math dist_complement_incl_test PASSED
math dist_exponential_incl_test PASSED
math dist_extreme_val_incl_test PASSED
math dist_find_location_incl_test PASSED
math dist_find_scale_incl_test PASSED
math dist_fisher_f_incl_test PASSED
math dist_gamma_incl_test PASSED
math dist_hypergeo_incl_test PASSED
math dist_inv_chi_sq_incl_test PASSED
math dist_inv_gamma_incl_test PASSED
math dist_laplace_incl_test PASSED
math dist_logistic_incl_test PASSED
math dist_lognormal_incl_test PASSED
math dist_nc_beta_incl_test PASSED
math dist_nc_chi_squ_incl_test PASSED
math dist_nc_f_incl_test PASSED
math dist_nc_t_incl_test PASSED
math dist_neg_binom_incl_test PASSED
math dist_normal_incl_test PASSED
math dist_poisson_incl_test PASSED
math dist_skew_norm_incl_test PASSED
math dist_students_t_incl_test PASSED
math dist_triangular_incl_test PASSED
math dist_uniform_incl_test PASSED
math dist_weibull_incl_test PASSED
math distribution_construction PASSED
math error_handling_example PASSED
math error_policies_example PASSED
math error_policy_example PASSED
math f_test PASSED
math find_location_example PASSED
math find_mean_and_sd_normal PASSED
math find_root_example PASSED
math find_scale_example PASSED
math geometric_examples PASSED
math hypot_test PASSED
math inverse_chi_squared_example PASSED
math inverse_gamma_distribution_example PASSED
math inverse_gamma_example PASSED
math laplace_example PASSED
math lexical_cast_nonfinite_facets PASSED
math log1p_expm1_test PASSED
math multiprc_concept_check_2 PASSED
math nc_chi_sq_example PASSED
math neg_binom_confidence_limits PASSED
math neg_binomial_sample_sizes PASSED
math negative_binomial_example1 PASSED
math negative_binomial_example2 PASSED
math neumann_zeros_example_1 PASSED
math nonfinite_facet_simple PASSED
math nonfinite_facet_sstream PASSED
math nonfinite_loopback_ok PASSED
math nonfinite_num_facet PASSED
math nonfinite_num_facet_serialization PASSED
math nonfinite_serialization_archives PASSED
math normal_misc_examples PASSED
math octonion_test PASSED
math owens_t_example PASSED
math policy_eg_1 PASSED
math policy_eg_10 PASSED
math policy_eg_2 PASSED
math policy_eg_3 PASSED
math policy_eg_4 PASSED
math policy_eg_5 PASSED
math policy_eg_6 PASSED
math policy_eg_7 PASSED
math policy_eg_8 PASSED
math policy_eg_9 PASSED
math policy_ref_snip1 PASSED
math policy_ref_snip10 PASSED
math policy_ref_snip11 PASSED
math policy_ref_snip12 PASSED
math policy_ref_snip13 PASSED
math policy_ref_snip2 PASSED
math policy_ref_snip3 PASSED
math policy_ref_snip4 PASSED
math policy_ref_snip5 PASSED
math policy_ref_snip6 PASSED
math policy_ref_snip7 PASSED
math policy_ref_snip8 PASSED
math policy_ref_snip9 PASSED
math pow_test PASSED
math powm1_sqrtp1m1_test PASSED
math quaternion_mult_incl_test PASSED
math quaternion_test PASSED
math sf_airy_incl_test PASSED
math sf_bessel_incl_test PASSED
math sf_beta_incl_test PASSED
math sf_binomial_incl_test PASSED
math sf_cbrt_incl_test PASSED
math sf_cos_pi_incl_test PASSED
math sf_digamma_incl_test PASSED
math sf_ellint_1_incl_test PASSED
math sf_ellint_2_incl_test PASSED
math sf_ellint_3_incl_test PASSED
math sf_ellint_rc_incl_test PASSED
math sf_ellint_rd_incl_test PASSED
math sf_ellint_rf_incl_test PASSED
math sf_ellint_rj_incl_test PASSED
math sf_erf_incl_test PASSED
math sf_expint_incl_test PASSED
math sf_expm1_incl_test PASSED
math sf_factorials_incl_test PASSED
math sf_fpclassify_incl_test PASSED
math sf_gamma_incl_test PASSED
math sf_hankel_incl_test PASSED
math sf_hermite_incl_test PASSED
math sf_hypot_incl_test PASSED
math sf_jacobi_incl_test PASSED
math sf_laguerre_incl_test PASSED
math sf_lanczos_incl_test PASSED
math sf_legendre_incl_test PASSED
math sf_log1p_incl_test PASSED
math sf_math_fwd_incl_test PASSED
math sf_modf_incl_test PASSED
math sf_next_incl_test PASSED
math sf_owens_t_incl_test PASSED
math sf_powm1_incl_test PASSED
math sf_round_incl_test PASSED
math sf_sign_incl_test PASSED
math sf_sin_pi_incl_test PASSED
math sf_sinc_incl_test PASSED
math sf_sinhc_incl_test PASSED
math sf_sph_harm_incl_test PASSED
math sf_sqrt1pm1_incl_test PASSED
math sf_trunc_incl_test PASSED
math sf_zeta_incl_test PASSED
math skew_normal_example PASSED
math special_functions_test PASSED
math students_t_example1 PASSED
math students_t_example2 PASSED
math students_t_example3 PASSED
math students_t_single_sample PASSED
math students_t_two_samples PASSED
math test_airy PASSED
math test_basic_nonfinite PASSED
math test_bernoulli PASSED
math test_bessel_airy_zeros PASSED
math test_bessel_i PASSED
math test_bessel_j PASSED
math test_bessel_k PASSED
math test_bessel_y PASSED
math test_beta PASSED
math test_beta_dist PASSED
math test_binomial_coeff PASSED
math test_binomial_double PASSED
math test_binomial_float PASSED
math test_binomial_long_double PASSED
math test_binomial_real_concept0 PASSED
math test_binomial_real_concept1 PASSED
math test_binomial_real_concept2 PASSED
math test_binomial_real_concept3 PASSED
math test_binomial_real_concept4 PASSED
math test_binomial_real_concept5 PASSED
math test_binomial_real_concept6 PASSED
math test_carlson PASSED
math test_cauchy PASSED
math test_cbrt PASSED
math test_chi_squared PASSED
math test_classify PASSED
math test_constants PASSED
math test_cpp_float_close_fraction PASSED
math test_digamma PASSED
math test_dist_overloads PASSED
math test_ellint_1 PASSED
math test_ellint_2 PASSED
math test_ellint_3 PASSED
math test_erf PASSED
math test_error_handling PASSED
math test_expint PASSED
math test_exponential_dist PASSED
math test_extreme_value PASSED
math test_factorials PASSED
math test_find_location PASSED
math test_find_scale PASSED
math test_fisher_f PASSED
math test_gamma PASSED
math test_gamma_dist PASSED
math test_geometric PASSED
math test_hermite PASSED
math test_hypergeometric_dist0 PASSED
math test_hypergeometric_dist1 PASSED
math test_hypergeometric_dist2 PASSED
math test_hypergeometric_dist3 PASSED
math test_hypergeometric_dist4 PASSED
math test_hypergeometric_dist5 PASSED
math test_ibeta_double PASSED
math test_ibeta_float PASSED
math test_ibeta_inv_ab_double PASSED
math test_ibeta_inv_ab_float PASSED
math test_ibeta_inv_ab_long_double PASSED
math test_ibeta_inv_ab_real_concept1 PASSED
math test_ibeta_inv_ab_real_concept2 PASSED
math test_ibeta_inv_ab_real_concept3 PASSED
math test_ibeta_inv_double PASSED
math test_ibeta_inv_float PASSED
math test_ibeta_inv_long_double PASSED
math test_ibeta_inv_real_concept1 PASSED
math test_ibeta_inv_real_concept2 PASSED
math test_ibeta_inv_real_concept3 PASSED
math test_ibeta_inv_real_concept4 PASSED
math test_ibeta_long_double PASSED
math test_ibeta_real_concept1 PASSED
math test_ibeta_real_concept2 PASSED
math test_ibeta_real_concept3 PASSED
math test_ibeta_real_concept4 PASSED
math test_igamma PASSED
math test_igamma_inv_double PASSED
math test_igamma_inv_float PASSED
math test_igamma_inv_long_double PASSED
math test_igamma_inv_real_concept PASSED
math test_igamma_inva_double PASSED
math test_igamma_inva_float PASSED
math test_igamma_inva_long_double PASSED
math test_igamma_inva_real_concept PASSED
math test_inverse_chi_squared_distribution PASSED
math test_inverse_gamma_distribution PASSED
math test_inverse_gaussian PASSED
math test_laguerre PASSED
math test_laplace PASSED
math test_ldouble_simple PASSED
math test_legacy_nonfinite PASSED
math test_legendre PASSED
math test_lexical_cast PASSED
math test_logistic_dist PASSED
math test_lognormal PASSED
math test_long_double_support PASSED
math test_minima PASSED
math test_nc_beta_float PASSED
math test_nc_chi_squared_real_concept PASSED
math test_nc_f PASSED
math test_nc_t_float PASSED
math test_nc_t_real_concept PASSED
math test_negative_binomial_double PASSED
math test_negative_binomial_float PASSED
math test_negative_binomial_long_double PASSED
math test_negative_binomial_real_concept PASSED
math test_next PASSED
math test_nonfinite_trap PASSED
math test_normal PASSED
math test_pareto PASSED
math test_poisson_double PASSED
math test_poisson_float PASSED
math test_poisson_long_double PASSED
math test_poisson_real_concept PASSED
math test_policy PASSED
math test_policy_2 PASSED
math test_policy_3 PASSED
math test_policy_4 PASSED
math test_policy_5 PASSED
math test_policy_6 PASSED
math test_policy_7 PASSED
math test_policy_8 PASSED
math test_policy_sf PASSED
math test_print_info_on_type PASSED
math test_rationals PASSED
math test_rayleigh PASSED
math test_real_concept PASSED
math test_remez PASSED
math test_roots PASSED
math test_round PASSED
math test_sign PASSED
math test_signed_zero PASSED
math test_skew_normal PASSED
math test_spherical_harmonic PASSED
math test_students_t PASSED
math test_tgamma_ratio PASSED
math test_toms748_solve PASSED
math test_tr1 PASSED
math test_tr1_c PASSED
math test_tr1_c_long_double PASSED
math test_tr1_long_double PASSED
math test_traits PASSED
math test_triangular PASSED
math test_uniform PASSED
math test_weibull PASSED
math test_zeta PASSED
math tools_config_inc_test PASSED
math tools_fraction_inc_test PASSED
math tools_minima_inc_test PASSED
math tools_polynomial_inc_test PASSED
math tools_precision_inc_test PASSED
math tools_rational_inc_test PASSED
math tools_real_cast_inc_test PASSED
math tools_remez_inc_test PASSED
math tools_roots_inc_test PASSED
math tools_series_inc_test PASSED
math tools_solve_inc_test PASSED
math tools_stats_inc_test PASSED
math tools_test_data_inc_test PASSED
math tools_test_inc_test PASSED
math tools_toms748_inc_test PASSED
math zztest_max_digits10 PASSED
math distribution_concept_check FAILED
math multiprc_concept_check_1 FAILED
math multiprc_concept_check_3 FAILED
math multiprc_concept_check_4 FAILED
math std_real_concept_check FAILED
math test_constant_generate FAILED
math test_hankel FAILED
math test_instantiate1 FAILED
math test_inv_hyp FAILED
math test_jacobi FAILED
math test_nc_beta_double FAILED
math test_nc_beta_long_double FAILED
math test_nc_beta_real_concept1 FAILED
math test_nc_beta_real_concept2 FAILED
math test_nc_chi_squared_double FAILED
math test_nc_chi_squared_float FAILED
math test_nc_chi_squared_long_double FAILED
math test_nc_t_double FAILED
math test_nc_t_long_double FAILED
math test_owens_t FAILED
move back_move_inserter PASSED
move construct_forward PASSED
move conversion_test PASSED
move copy_elision_test PASSED
move copy_move_optimization PASSED
move doc_clone_ptr PASSED
move doc_construct_forward PASSED
move doc_file_descriptor PASSED
move doc_how_works PASSED
move doc_move_algorithms PASSED
move doc_move_inserter PASSED
move doc_move_iterator PASSED
move move PASSED
move move_algorithm PASSED
move move_iterator PASSED
mpl advance PASSED
mpl always PASSED
mpl apply PASSED
mpl apply_wrap PASSED
mpl arithmetic PASSED
mpl as_sequence PASSED
mpl assert PASSED
mpl at PASSED
mpl back PASSED
mpl bind PASSED
mpl bitwise PASSED
mpl bool PASSED
mpl char PASSED
mpl comparison PASSED
mpl contains PASSED
mpl copy PASSED
mpl copy_if PASSED
mpl count PASSED
mpl count_if PASSED
mpl deque PASSED
mpl distance PASSED
mpl empty PASSED
mpl equal PASSED
mpl erase PASSED
mpl erase_range PASSED
mpl eval_if PASSED
mpl filter_view PASSED
mpl find PASSED
mpl find_if PASSED
mpl fold PASSED
mpl for_each PASSED
mpl front PASSED
mpl has_xxx PASSED
mpl identity PASSED
mpl if PASSED
mpl index_of PASSED
mpl inherit PASSED
mpl insert PASSED
mpl insert_range PASSED
mpl int PASSED
mpl integral_c PASSED
mpl is_placeholder PASSED
mpl is_seq PASSED
mpl is_sequence PASSED
mpl iterator_tags PASSED
mpl joint_view PASSED
mpl lambda PASSED
mpl lambda_args PASSED
mpl largest_int PASSED
mpl list PASSED
mpl list_c PASSED
mpl logical PASSED
mpl lower_bound PASSED
mpl map PASSED
mpl max_element PASSED
mpl min_max PASSED
mpl msvc_is_class PASSED
mpl multiset PASSED
mpl next PASSED
mpl no_has_xxx PASSED
mpl numeric_ops PASSED
mpl pair_view PASSED
mpl partition PASSED
mpl pop_front PASSED
mpl push_back PASSED
mpl push_front PASSED
mpl quote PASSED
mpl range_c PASSED
mpl remove PASSED
mpl remove_if PASSED
mpl replace PASSED
mpl replace_if PASSED
mpl reverse PASSED
mpl same_as PASSED
mpl set PASSED
mpl set_c PASSED
mpl single_view PASSED
mpl size PASSED
mpl size_t PASSED
mpl sizeof PASSED
mpl sort PASSED
mpl stable_partition PASSED
mpl string PASSED
mpl template_arity PASSED
mpl token_equal PASSED
mpl transform PASSED
mpl transform_view PASSED
mpl unique PASSED
mpl unpack_args PASSED
mpl upper_bound PASSED
mpl vector PASSED
mpl vector_c PASSED
mpl zip_view PASSED
msm Anonymous PASSED
msm CompositeMachine PASSED
msm Constructor PASSED
msm History PASSED
msm OrthogonalDeferred PASSED
msm Serialize PASSED
msm SerializeWithHistory PASSED
msm SimpleInternal PASSED
msm SimpleInternalFunctors PASSED
msm SimpleMachine PASSED
msm SimpleWithFunctors PASSED
msm TestConstructor PASSED
msm AnonymousEuml FAILED
msm CompositeEuml FAILED
msm Entries FAILED
msm OrthogonalDeferred2 FAILED
msm OrthogonalDeferredEuml FAILED
msm SerializeSimpleEuml FAILED
msm SimpleEuml FAILED
msm SimpleEuml2 FAILED
msm SimpleInternalEuml FAILED
multi_array access PASSED
multi_array assert PASSED
multi_array assign PASSED
multi_array assign_to_array PASSED
multi_array compare PASSED
multi_array concept_checks PASSED
multi_array constructors PASSED
multi_array fail_cbracket PASSED
multi_array fail_cdata PASSED
multi_array fail_citerator PASSED
multi_array fail_cparen PASSED
multi_array fail_criterator PASSED
multi_array fail_csubarray PASSED
multi_array fail_csubarray2 PASSED
multi_array fail_csubarray3 PASSED
multi_array fail_cview PASSED
multi_array fail_cview2 PASSED
multi_array fail_cview3 PASSED
multi_array fail_ref_cbracket PASSED
multi_array fail_ref_cdata PASSED
multi_array fail_ref_citerator PASSED
multi_array fail_ref_cparen PASSED
multi_array fail_ref_criterator PASSED
multi_array fail_ref_csubarray PASSED
multi_array fail_ref_csubarray2 PASSED
multi_array fail_ref_csubarray3 PASSED
multi_array fail_ref_cview PASSED
multi_array fail_ref_cview2 PASSED
multi_array fail_ref_cview3 PASSED
multi_array idxgen1 PASSED
multi_array index_bases PASSED
multi_array iterators PASSED
multi_array range1 PASSED
multi_array reshape PASSED
multi_array resize PASSED
multi_array reverse_view PASSED
multi_array slice PASSED
multi_array stl_interaction PASSED
multi_array storage_order PASSED
multi_array storage_order_convert PASSED
multi_index test_basic PASSED
multi_index test_capacity PASSED
multi_index test_comparison PASSED
multi_index test_composite_key PASSED
multi_index test_conv_iterators PASSED
multi_index test_copy_assignment PASSED
multi_index test_hash_ops PASSED
multi_index test_iterators PASSED
multi_index test_key_extractors PASSED
multi_index test_list_ops PASSED
multi_index test_modifiers PASSED
multi_index test_mpl_ops PASSED
multi_index test_observers PASSED
multi_index test_projection PASSED
multi_index test_range PASSED
multi_index test_rearrange PASSED
multi_index test_safe_mode PASSED
multi_index test_serialization PASSED
multi_index test_set_ops PASSED
multi_index test_special_set_ops PASSED
multi_index test_update PASSED
multiprecision conv_fail_01 PASSED
multiprecision conv_fail_02 PASSED
multiprecision conv_fail_03 PASSED
multiprecision conv_fail_04 PASSED
multiprecision conv_fail_05 PASSED
multiprecision conv_fail_06 PASSED
multiprecision conv_fail_07 PASSED
multiprecision conv_fail_08 PASSED
multiprecision conv_fail_09 PASSED
multiprecision conv_fail_10 PASSED
multiprecision conv_fail_11 PASSED
multiprecision conv_fail_12 PASSED
multiprecision conv_fail_13 PASSED
multiprecision conv_fail_14 PASSED
multiprecision conv_fail_15 PASSED
multiprecision conv_fail_16 PASSED
multiprecision conv_fail_17 PASSED
multiprecision conv_fail_18 PASSED
multiprecision conv_fail_19 PASSED
multiprecision conv_fail_20 PASSED
multiprecision conv_fail_21 PASSED
multiprecision conv_fail_22 PASSED
multiprecision conv_fail_23 PASSED
multiprecision conv_fail_24 PASSED
multiprecision conv_fail_25 PASSED
multiprecision conv_fail_26 PASSED
multiprecision conv_fail_27 PASSED
multiprecision conv_fail_28 PASSED
multiprecision conv_fail_29 PASSED
multiprecision conv_fail_30 PASSED
multiprecision conv_fail_31 PASSED
multiprecision conv_fail_32 PASSED
multiprecision conv_fail_33 PASSED
multiprecision conv_fail_34 PASSED
multiprecision conv_fail_35 PASSED
multiprecision conv_fail_36 PASSED
multiprecision conv_fail_37 PASSED
multiprecision conv_fail_38 PASSED
multiprecision conv_fail_39 PASSED
multiprecision conv_fail_40 PASSED
multiprecision conv_fail_41 PASSED
multiprecision conv_fail_42 PASSED
multiprecision conv_fail_43 PASSED
multiprecision conv_fail_44 PASSED
multiprecision conv_fail_45 PASSED
multiprecision conv_fail_46 PASSED
multiprecision conv_fail_47 PASSED
multiprecision conv_fail_48 PASSED
multiprecision conv_fail_49 PASSED
multiprecision conv_fail_50 PASSED
multiprecision conv_fail_51 PASSED
multiprecision conv_fail_52 PASSED
multiprecision conv_fail_53 PASSED
multiprecision conv_fail_54 PASSED
multiprecision conv_fail_55 PASSED
multiprecision conv_fail_56 PASSED
multiprecision conv_fail_57 PASSED
multiprecision conv_fail_58 PASSED
multiprecision conv_fail_59 PASSED
multiprecision cpp_dec_float_include_test PASSED
multiprecision cpp_dec_float_snips PASSED
multiprecision cpp_int_complement PASSED
multiprecision cpp_int_include_test PASSED
multiprecision cpp_int_negate_1 PASSED
multiprecision cpp_int_negate_2 PASSED
multiprecision floating_point_examples PASSED
multiprecision number_concept_check_backend_concept PASSED
multiprecision number_concept_check_cpp_dec_float PASSED
multiprecision number_concept_check_cpp_dec_float_no_et PASSED
multiprecision number_concept_check_logged_adaptor PASSED
multiprecision operator_fail_01 PASSED
multiprecision operator_fail_02 PASSED
multiprecision sf_concept_check_basic_backend_concept PASSED
multiprecision sf_concept_check_basic_cpp_dec_float PASSED
multiprecision sf_concept_check_basic_cpp_dec_float_no_et PASSED
multiprecision sf_concept_check_basic_logged_adaptor PASSED
multiprecision sf_concept_check_bessel_backend_concept PASSED
multiprecision sf_concept_check_bessel_cpp_dec_float PASSED
multiprecision sf_concept_check_bessel_cpp_dec_float_no_et PASSED
multiprecision sf_concept_check_bessel_logged_adaptor PASSED
multiprecision sf_concept_check_elliptic_backend_concept PASSED
multiprecision sf_concept_check_elliptic_cpp_dec_float PASSED
multiprecision sf_concept_check_elliptic_cpp_dec_float_no_et PASSED
multiprecision sf_concept_check_elliptic_logged_adaptor PASSED
multiprecision sf_concept_check_gamma_backend_concept PASSED
multiprecision sf_concept_check_gamma_cpp_dec_float PASSED
multiprecision sf_concept_check_gamma_cpp_dec_float_no_et PASSED
multiprecision sf_concept_check_gamma_logged_adaptor PASSED
multiprecision sf_concept_check_poly_backend_concept PASSED
multiprecision sf_concept_check_poly_cpp_dec_float PASSED
multiprecision sf_concept_check_poly_cpp_dec_float_no_et PASSED
multiprecision sf_concept_check_poly_logged_adaptor PASSED
multiprecision test1 PASSED
multiprecision test2 PASSED
multiprecision test4 PASSED
multiprecision test5 PASSED
multiprecision test6 PASSED
multiprecision test_acos_cpp_dec_float PASSED
multiprecision test_adapt_serial PASSED
multiprecision test_arithmetic_ab_1 PASSED
multiprecision test_arithmetic_ab_2 PASSED
multiprecision test_arithmetic_ab_3 PASSED
multiprecision test_arithmetic_backend_concept PASSED
multiprecision test_arithmetic_cpp_dec_float_1 PASSED
multiprecision test_arithmetic_cpp_dec_float_2 PASSED
multiprecision test_arithmetic_cpp_dec_float_3 PASSED
multiprecision test_arithmetic_cpp_int_13 PASSED
multiprecision test_arithmetic_cpp_int_14 PASSED
multiprecision test_arithmetic_cpp_int_15 PASSED
multiprecision test_arithmetic_cpp_int_16 PASSED
multiprecision test_arithmetic_cpp_int_17 PASSED
multiprecision test_arithmetic_cpp_int_18 PASSED
multiprecision test_arithmetic_dbg_adptr1 PASSED
multiprecision test_arithmetic_logged_1 PASSED
multiprecision test_asin_cpp_dec_float PASSED
multiprecision test_atan_cpp_dec_float PASSED
multiprecision test_checked_cpp_int PASSED
multiprecision test_constants_cpp_dec_float PASSED
multiprecision test_constexpr PASSED
multiprecision test_cos_cpp_dec_float PASSED
multiprecision test_cosh_cpp_dec_float PASSED
multiprecision test_cpp_dec_float_round PASSED
multiprecision test_cpp_dec_float_serial_1 PASSED
multiprecision test_cpp_dec_float_serial_2 PASSED
multiprecision test_cpp_int_lit PASSED
multiprecision test_cpp_int_serial_2 PASSED
multiprecision test_cpp_int_serial_3 PASSED
multiprecision test_cpp_int_serial_4 PASSED
multiprecision test_exp_cpp_dec_float PASSED
multiprecision test_float_io_cpp_dec_float PASSED
multiprecision test_fpclassify_cpp_dec_float PASSED
multiprecision test_log_cpp_dec_float PASSED
multiprecision test_mixed_float PASSED
multiprecision test_move_cpp_int PASSED
multiprecision test_numeric_limits_backend_concept PASSED
multiprecision test_numeric_limits_cpp_dec_float PASSED
multiprecision test_numeric_limits_cpp_int PASSED
multiprecision test_pow_cpp_dec_float PASSED
multiprecision test_round_cpp_dec_float PASSED
multiprecision test_sin_cpp_dec_float PASSED
multiprecision test_sinh_cpp_dec_float PASSED
multiprecision test_sqrt_cpp_dec_float PASSED
multiprecision test_tan_cpp_dec_float PASSED
multiprecision test_tanh_cpp_dec_float PASSED
multiprecision test_test PASSED
multiprecision ublas1_et PASSED
multiprecision ublas2_et PASSED
multiprecision ublas3_et PASSED
multiprecision ublas4_et PASSED
multiprecision ublas5_et PASSED
multiprecision cpp_int_snips FAILED
multiprecision test_arithmetic_cpp_int_1 FAILED
multiprecision test_arithmetic_cpp_int_10 FAILED
multiprecision test_arithmetic_cpp_int_11 FAILED
multiprecision test_arithmetic_cpp_int_12 FAILED
multiprecision test_arithmetic_cpp_int_2 FAILED
multiprecision test_arithmetic_cpp_int_3 FAILED
multiprecision test_arithmetic_cpp_int_4 FAILED
multiprecision test_arithmetic_cpp_int_5 FAILED
multiprecision test_arithmetic_cpp_int_6 FAILED
multiprecision test_arithmetic_cpp_int_7 FAILED
multiprecision test_arithmetic_cpp_int_8 FAILED
multiprecision test_arithmetic_cpp_int_9 FAILED
multiprecision test_arithmetic_cpp_int_br FAILED
multiprecision test_arithmetic_dbg_adptr2 FAILED
multiprecision test_arithmetic_logged_2 FAILED
multiprecision test_cpp_int_conv FAILED
multiprecision test_cpp_int_deserial FAILED
multiprecision test_cpp_int_serial_1 FAILED
multiprecision test_cpp_rat_serial FAILED
multiprecision test_generic_conv FAILED
multiprecision test_int_io_cpp_int FAILED
multiprecision test_mixed_cpp_int FAILED
multiprecision test_native_integer FAILED
multiprecision test_rational_io_cpp_int FAILED
numeric adams_bashforth PASSED
numeric adams_bashforth_moulton PASSED
numeric adams_moulton PASSED
numeric add PASSED
numeric begin_end PASSED
numeric bounds_test PASSED
numeric built_in_numeric_cast_traits PASSED
numeric bulirsch_stoer PASSED
numeric cmp PASSED
numeric cmp_exn PASSED
numeric cmp_exp PASSED
numeric cmp_lex PASSED
numeric cmp_set PASSED
numeric cmp_tribool PASSED
numeric comp_mat_erase PASSED
numeric concepts PASSED
numeric converter_test PASSED
numeric default_operations PASSED
numeric det PASSED
numeric euler_stepper PASSED
numeric fmod PASSED
numeric generation PASSED
numeric generic_error_stepper PASSED
numeric generic_stepper PASSED
numeric implicit_euler PASSED
numeric integer PASSED
numeric integrate PASSED
numeric integrate_times PASSED
numeric is_pair PASSED
numeric is_resizeable PASSED
numeric mul PASSED
numeric num_columns PASSED
numeric num_rows PASSED
numeric numeric_cast_test PASSED
numeric numeric_cast_traits_test PASSED
numeric overflow PASSED
numeric pi PASSED
numeric placement_new PASSED
numeric pow PASSED
numeric range_algebra PASSED
numeric resize PASSED
numeric resizing PASSED
numeric rosenbrock4 PASSED
numeric runge_kutta_concepts PASSED
numeric runge_kutta_controlled_concepts PASSED
numeric runge_kutta_error_concepts PASSED
numeric same_size PASSED
numeric size PASSED
numeric sparse_view_test PASSED
numeric stepper_copying PASSED
numeric stepper_with_ranges PASSED
numeric symplectic_steppers PASSED
numeric test1 PASSED
numeric test2 PASSED
numeric test3 PASSED
numeric test3_mvov PASSED
numeric test4 PASSED
numeric test5 PASSED
numeric test6 PASSED
numeric test_assignment PASSED
numeric test_complex_norms PASSED
numeric test_coordinate_matrix_inplace_merge PASSED
numeric test_coordinate_matrix_sort PASSED
numeric test_coordinate_vector_inplace_merge PASSED
numeric test_float PASSED
numeric test_inplace_solve_basic PASSED
numeric test_inplace_solve_mvov PASSED
numeric test_inplace_solve_sparse PASSED
numeric test_lu PASSED
numeric test_ticket7296 PASSED
numeric test_triangular PASSED
numeric traits_test PASSED
numeric triangular_access PASSED
numeric triangular_layout PASSED
numeric trivial_state PASSED
numeric udt_example_0 PASSED
numeric udt_support_test PASSED
numeric fusion_algebra FAILED
numeric integrate_implicit FAILED
numeric stepper_with_units FAILED
optional optional_test PASSED
optional optional_test_fail1 PASSED
optional optional_test_fail3a PASSED
optional optional_test_fail3b PASSED
optional optional_test_inplace PASSED
optional optional_test_inplace_fail PASSED
optional optional_test_inplace_fail2 PASSED
optional optional_test_io PASSED
optional optional_test_ref PASSED
optional optional_test_ref_fail1 PASSED
optional optional_test_ref_fail3 PASSED
optional optional_test_ref_fail4 PASSED
optional optional_test_tie PASSED
parameter basics PASSED
parameter compose PASSED
parameter deduced PASSED
parameter deduced_dependent_predicate PASSED
parameter deduced_unmatched_arg PASSED
parameter duplicates PASSED
parameter earwicker PASSED
parameter efficiency PASSED
parameter macros PASSED
parameter maybe PASSED
parameter mpl PASSED
parameter normalized_argument_types PASSED
parameter ntp PASSED
parameter optional_deduced_sfinae PASSED
parameter preprocessor PASSED
parameter preprocessor_deduced PASSED
parameter sfinae PASSED
parameter singular PASSED
parameter tutorial PASSED
parameter unwrap_cv_reference PASSED
parameter python_test FAILED
phoenix actor PASSED
phoenix adapt_function PASSED
phoenix algorithm PASSED
phoenix argument PASSED
phoenix arithmetic PASSED
phoenix arithmetic_tests PASSED
phoenix arity PASSED
phoenix at PASSED
phoenix bind PASSED
phoenix bind_and_or_test PASSED
phoenix bind_const_test PASSED
phoenix bind_cv_test PASSED
phoenix bind_dm2_test PASSED
phoenix bind_dm3_test PASSED
phoenix bind_dm_test PASSED
phoenix bind_eq2_test PASSED
phoenix bind_eq3_test PASSED
phoenix bind_eq_test PASSED
phoenix bind_fn2_test PASSED
phoenix bind_function_object_tests PASSED
phoenix bind_function_test PASSED
phoenix bind_function_tests PASSED
phoenix bind_member_function_tests PASSED
phoenix bind_member_variable_tests PASSED
phoenix bind_mf2_test PASSED
phoenix bind_not_test PASSED
phoenix bind_placeholder_test PASSED
phoenix bind_ref_test PASSED
phoenix bind_rel_test PASSED
phoenix bind_rv_sp_test PASSED
phoenix bind_rvalue_test PASSED
phoenix bind_stateful_test PASSED
phoenix bind_test PASSED
phoenix bitwise PASSED
phoenix bitwise_tests PASSED
phoenix bug3289 PASSED
phoenix bug4853 PASSED
phoenix bug5626 PASSED
phoenix bug5782 PASSED
phoenix bug5968 PASSED
phoenix bug6040 PASSED
phoenix bug_000008 PASSED
phoenix cast_tests PASSED
phoenix comparison PASSED
phoenix comparison_tests PASSED
phoenix const_cast PASSED
phoenix construct PASSED
phoenix container PASSED
phoenix container_container PASSED
phoenix container_tests1a PASSED
phoenix container_tests1b PASSED
phoenix container_tests2a PASSED
phoenix container_tests2b PASSED
phoenix container_tests3a PASSED
phoenix container_tests3b PASSED
phoenix container_tests4a PASSED
phoenix container_tests4b PASSED
phoenix container_tests5a PASSED
phoenix container_tests5b PASSED
phoenix container_tests6a PASSED
phoenix container_tests6b PASSED
phoenix core PASSED
phoenix delete PASSED
phoenix do_while PASSED
phoenix domain PASSED
phoenix dynamic PASSED
phoenix dynamic_cast PASSED
phoenix dynamic_tests PASSED
phoenix environment PASSED
phoenix exceptions PASSED
phoenix expression PASSED
phoenix for PASSED
phoenix function PASSED
phoenix function_equal PASSED
phoenix function_function PASSED
phoenix function_tests PASSED
phoenix fusion PASSED
phoenix if PASSED
phoenix if_else PASSED
phoenix if_else_tests PASSED
phoenix if_tests PASSED
phoenix include_iteration PASSED
phoenix include_querying PASSED
phoenix io PASSED
phoenix io_tests PASSED
phoenix is_actor PASSED
phoenix is_nullary PASSED
phoenix iterate PASSED
phoenix iteration PASSED
phoenix lambda PASSED
phoenix lambda_tests PASSED
phoenix let PASSED
phoenix let_tests PASSED
phoenix limits PASSED
phoenix local_variable PASSED
phoenix logical PASSED
phoenix logical_tests PASSED
phoenix loops_tests PASSED
phoenix meta_grammar PASSED
phoenix misc_binary_tests PASSED
phoenix new PASSED
phoenix new_delete_tests PASSED
phoenix nothing PASSED
phoenix object PASSED
phoenix operator PASSED
phoenix operator_member PASSED
phoenix primitives_tests PASSED
phoenix querying PASSED
phoenix querying2 PASSED
phoenix reference PASSED
phoenix reinterpret_cast PASSED
phoenix round PASSED
phoenix scope PASSED
phoenix scoped_environment PASSED
phoenix self PASSED
phoenix self_tests PASSED
phoenix sequence PASSED
phoenix statement PASSED
phoenix static_cast PASSED
phoenix stl PASSED
phoenix switch PASSED
phoenix switch_tests PASSED
phoenix terminal PASSED
phoenix this PASSED
phoenix throw PASSED
phoenix transformation PASSED
phoenix transformation1 PASSED
phoenix transformation2 PASSED
phoenix transformation3 PASSED
phoenix transformation4 PASSED
phoenix try_catch PASSED
phoenix unary_tests PASSED
phoenix value PASSED
phoenix version PASSED
phoenix visit_each PASSED
phoenix while PASSED
phoenix member FAILED
polygon gtl_boost_unit_test PASSED
polygon polygon_interval_test PASSED
polygon polygon_point_test PASSED
polygon polygon_segment_test PASSED
polygon voronoi_builder_test PASSED
polygon voronoi_ctypes_test PASSED
polygon voronoi_diagram_test PASSED
polygon voronoi_geometry_type_test PASSED
polygon voronoi_predicates_test PASSED
polygon voronoi_robust_fpt_test PASSED
polygon voronoi_structures_test PASSED
pool pool_msvc_compiler_bug_test PASSED
pool test_bug_1252 PASSED
pool test_bug_2696 PASSED
pool test_bug_3349 PASSED
pool test_bug_4960 PASSED
pool test_bug_5526 PASSED
pool test_msvc_mem_leak_detect PASSED
pool test_poisoned_macros PASSED
pool test_pool_alloc PASSED
pool test_simple_seg_storage PASSED
pool test_threading PASSED
pool time_pool_alloc PASSED
predef info_as_c PASSED
predef info_as_cpp PASSED
predef macos_endian PASSED
predef macos_vs_bsd PASSED
predef make PASSED
predef version PASSED
preprocessor arithmetic PASSED
preprocessor arithmetic_c PASSED
preprocessor arithmetic_c_nvm PASSED
preprocessor arithmetic_nvm PASSED
preprocessor array PASSED
preprocessor array_c PASSED
preprocessor array_nvm PASSED
preprocessor comparison PASSED
preprocessor comparison_c PASSED
preprocessor comparison_c_nvm PASSED
preprocessor comparison_nvm PASSED
preprocessor control PASSED
preprocessor control_c PASSED
preprocessor control_c_nvm PASSED
preprocessor control_nvm PASSED
preprocessor debug PASSED
preprocessor debug_c PASSED
preprocessor debug_c_nvm PASSED
preprocessor debug_nvm PASSED
preprocessor facilities PASSED
preprocessor facilities_c PASSED
preprocessor facilities_c_nvm PASSED
preprocessor facilities_nvm PASSED
preprocessor iteration PASSED
preprocessor iteration_nvm PASSED
preprocessor list PASSED
preprocessor list_c PASSED
preprocessor list_c_nvm PASSED
preprocessor list_nvm PASSED
preprocessor logical PASSED
preprocessor logical_c PASSED
preprocessor logical_c_nvm PASSED
preprocessor logical_nvm PASSED
preprocessor repetition PASSED
preprocessor repetition_nvm PASSED
preprocessor selection PASSED
preprocessor selection_c PASSED
preprocessor selection_c_nvm PASSED
preprocessor selection_nvm PASSED
preprocessor seq PASSED
preprocessor seq_c_nvm PASSED
preprocessor seq_nvm PASSED
preprocessor slot PASSED
preprocessor slot_c PASSED
preprocessor slot_c_nvm PASSED
preprocessor slot_nvm PASSED
preprocessor tuple PASSED
preprocessor tuple_c PASSED
preprocessor tuple_nvm PASSED
preprocessor variadic PASSED
preprocessor variadic_c PASSED
preprocessor array_c_nvm FAILED
preprocessor seq_c FAILED
preprocessor tuple_c_nvm FAILED
program_options cmdline_test PASSED
program_options cmdline_test_dll PASSED
program_options exception_test PASSED
program_options exception_test_dll PASSED
program_options options_description_test PASSED
program_options options_description_test_dll PASSED
program_options parsers_test PASSED
program_options parsers_test_dll PASSED
program_options positional_options_test PASSED
program_options positional_options_test_dll PASSED
program_options required_test PASSED
program_options required_test_dll PASSED
program_options split_test PASSED
program_options split_test_dll PASSED
program_options unicode_test PASSED
program_options unicode_test_dll PASSED
program_options unrecognized_test PASSED
program_options unrecognized_test_dll PASSED
program_options variable_map_test PASSED
program_options variable_map_test_dll PASSED
program_options winmain PASSED
program_options winmain_dll PASSED
property_map compose_property_map_test PASSED
property_map dynamic_properties_test PASSED
property_map function_property_map_test PASSED
property_map property_map_cc PASSED
property_map transform_value_property_map_test PASSED
property_tree test_info_parser PASSED
property_tree test_ini_parser PASSED
property_tree test_json_parser PASSED
property_tree test_multi_module1 PASSED
property_tree test_property_tree PASSED
property_tree test_xml_parser_rapidxml PASSED
proto bug2407 PASSED
proto calculator PASSED
proto constrained_ops PASSED
proto cpp-next_bug PASSED
proto deduce_domain PASSED
proto deep_copy PASSED
proto display_expr PASSED
proto env_var PASSED
proto examples PASSED
proto external_transforms PASSED
proto make PASSED
proto make_expr PASSED
proto matches PASSED
proto mem_ptr PASSED
proto mpl PASSED
proto noinvoke PASSED
proto pack_expansion PASSED
proto protect PASSED
proto switch PASSED
proto toy_spirit PASSED
proto toy_spirit2 PASSED
proto flatten FAILED
proto lambda FAILED
ptr_container incomplete_type_test PASSED
ptr_container indirect_fun PASSED
ptr_container iterator_test PASSED
ptr_container no_exceptions PASSED
ptr_container ptr_circular_buffer PASSED
ptr_container ptr_deque PASSED
ptr_container ptr_inserter PASSED
ptr_container ptr_list PASSED
ptr_container ptr_map PASSED
ptr_container ptr_map_adapter PASSED
ptr_container ptr_set PASSED
ptr_container ptr_unordered_map PASSED
ptr_container ptr_unordered_set PASSED
ptr_container ptr_vector PASSED
ptr_container tree_test PASSED
ptr_container tut1 PASSED
ptr_container view_example PASSED
ptr_container ptr_array FAILED
ptr_container serialization FAILED
python andreas_beyer PASSED
python args PASSED
python as_to_python_function PASSED
python auto_ptr PASSED
python back_reference PASSED
python bases PASSED
python ben_scott1 PASSED
python bienstman1 PASSED
python bienstman2 PASSED
python bienstman3 PASSED
python borrowed PASSED
python builtin_converters PASSED
python callbacks PASSED
python class PASSED
python const_argument PASSED
python copy_ctor_mutates_rhs PASSED
python crossmod_exception PASSED
python crossmod_opaque PASSED
python data_members PASSED
python defaults PASSED
python destroy_test PASSED
python dict PASSED
python docstring PASSED
python enable_shared_from_this PASSED
python enum PASSED
python exception_translator PASSED
python exec PASSED
python exec-dynamic PASSED
python extract PASSED
python if_else PASSED
python implicit PASSED
python import_ PASSED
python indirect_traits_test PASSED
python injected PASSED
python iterator PASSED
python keywords PASSED
python list PASSED
python long PASSED
python map_indexing_suite PASSED
python minimal PASSED
python multi_arg_constructor PASSED
python nested PASSED
python numpy PASSED
python object PASSED
python object_fail1 PASSED
python object_manager PASSED
python opaque PASSED
python operators PASSED
python operators_wrapper PASSED
python pearu1 PASSED
python pickle1 PASSED
python pickle2 PASSED
python pickle3 PASSED
python pickle4 PASSED
python pointee PASSED
python pointer_type_id_test PASSED
python pointer_vector PASSED
python polymorphism PASSED
python polymorphism2 PASSED
python polymorphism2_auto_ptr PASSED
python properties PASSED
python pytype_function PASSED
python raw_ctor PASSED
python raw_pyobject_fail1 PASSED
python raw_pyobject_fail2 PASSED
python result PASSED
python return_arg PASSED
python select_arg_to_python_test PASSED
python select_holder PASSED
python shared_ptr PASSED
python slice PASSED
python staticmethod PASSED
python stl_iterator PASSED
python str PASSED
python string_literal PASSED
python test_pointer_adoption PASSED
python try PASSED
python tuple PASSED
python upcast PASSED
python virtual_functions PASSED
python voidptr PASSED
python wrapper_held_type PASSED
python select_from_python_test FAILED
python vector_indexing_suite FAILED
random random_demo PASSED
random test_bernoulli PASSED
random test_bernoulli_distribution PASSED
random test_binomial PASSED
random test_binomial_distribution PASSED
random test_cauchy PASSED
random test_cauchy_distribution PASSED
random test_chi_squared PASSED
random test_chi_squared_distribution PASSED
random test_const_mod PASSED
random test_discrete PASSED
random test_discrete_distribution PASSED
random test_ecuyer1988 PASSED
random test_exponential PASSED
random test_exponential_distribution PASSED
random test_extreme_value PASSED
random test_extreme_value_distribution PASSED
random test_fisher_f PASSED
random test_fisher_f_distribution PASSED
random test_gamma PASSED
random test_gamma_distribution PASSED
random test_generate_canonical PASSED
random test_geometric PASSED
random test_geometric_distribution PASSED
random test_hellekalek1995 PASSED
random test_independent_bits31 PASSED
random test_independent_bits32 PASSED
random test_knuth_b PASSED
random test_kreutzer1986 PASSED
random test_lagged_fibonacci PASSED
random test_lagged_fibonacci607 PASSED
random test_linear_feedback_shift PASSED
random test_lognormal PASSED
random test_lognormal_distribution PASSED
random test_minstd_rand PASSED
random test_minstd_rand0 PASSED
random test_mt11213b PASSED
random test_mt19937 PASSED
random test_mt19937_64 PASSED
random test_negative_binomial PASSED
random test_negative_binomial_distribution PASSED
random test_normal PASSED
random test_normal_distribution PASSED
random test_old_uniform_int PASSED
random test_old_uniform_int_distribution PASSED
random test_old_uniform_real PASSED
random test_old_uniform_real_distribution PASSED
random test_piecewise_constant PASSED
random test_piecewise_constant_distribution PASSED
random test_piecewise_linear PASSED
random test_piecewise_linear_distribution PASSED
random test_poisson PASSED
random test_poisson_distribution PASSED
random test_rand48 PASSED
random test_random_device PASSED
random test_random_device_dll PASSED
random test_random_number_generator PASSED
random test_ranlux24 PASSED
random test_ranlux24_base PASSED
random test_ranlux3 PASSED
random test_ranlux3_01 PASSED
random test_ranlux4 PASSED
random test_ranlux48 PASSED
random test_ranlux48_base PASSED
random test_ranlux4_01 PASSED
random test_ranlux64_3 PASSED
random test_ranlux64_3_01 PASSED
random test_ranlux64_4 PASSED
random test_ranlux64_4_01 PASSED
random test_seed_seq PASSED
random test_student_t PASSED
random test_student_t_distribution PASSED
random test_taus88 PASSED
random test_triangle PASSED
random test_triangle_distribution PASSED
random test_uniform_int PASSED
random test_uniform_int_distribution PASSED
random test_uniform_on_sphere_distribution PASSED
random test_uniform_real PASSED
random test_uniform_real_distribution PASSED
random test_uniform_smallint PASSED
random test_uniform_smallint_distribution PASSED
random test_weibull PASSED
random test_weibull_distribution PASSED
random test_zero_seed PASSED
range adjacent_filtered PASSED
range adjacent_filtered_example PASSED
range adjacent_find PASSED
range adl_conformance PASSED
range adl_conformance_no_using PASSED
range algorithm PASSED
range algorithm_example PASSED
range array PASSED
range begin PASSED
range binary_search PASSED
range combine PASSED
range compat2 PASSED
range compat3 PASSED
range const_ranges PASSED
range copied PASSED
range copied_example PASSED
range copy PASSED
range copy_backward PASSED
range copy_n PASSED
range count PASSED
range count_if PASSED
range counting_range PASSED
range end PASSED
range equal PASSED
range equal_range PASSED
range erase PASSED
range extension_mechanism PASSED
range extension_size PASSED
range fill PASSED
range filtered PASSED
range filtered_example PASSED
range find PASSED
range find_end PASSED
range find_first_of PASSED
range find_if PASSED
range for_each PASSED
range for_each_ext PASSED
range generate PASSED
range has_range_iterator PASSED
range heap PASSED
range includes PASSED
range indexed PASSED
range indexed_example PASSED
range indirected PASSED
range indirected_example PASSED
range inplace_merge PASSED
range insert PASSED
range iota PASSED
range irange PASSED
range is_sorted PASSED
range istream_range PASSED
range iterator_pair PASSED
range iterator_range PASSED
range iterator_range1 PASSED
range join PASSED
range lexicographical_compare PASSED
range lower_bound PASSED
range map PASSED
range map_keys_example PASSED
range map_values_example PASSED
range max_element PASSED
range merge PASSED
range min_element PASSED
range mismatch PASSED
range next_permutation PASSED
range nth_element PASSED
range overwrite PASSED
range partial_sort PASSED
range partial_workaround PASSED
range partition PASSED
range pointer_as_iterator PASSED
range prev_permutation PASSED
range push_back PASSED
range push_front PASSED
range random_shuffle PASSED
range remove PASSED
range remove_copy PASSED
range remove_copy_if PASSED
range remove_if PASSED
range replace PASSED
range replace_copy PASSED
range replace_copy_if PASSED
range replace_if PASSED
range replaced PASSED
range replaced_example PASSED
range replaced_if PASSED
range replaced_if_example PASSED
range reverse PASSED
range reverse_copy PASSED
range reversed PASSED
range reversed_example PASSED
range reversible_range PASSED
range rotate PASSED
range rotate_copy PASSED
range search PASSED
range search_n PASSED
range set_difference PASSED
range set_intersection PASSED
range set_symmetric_difference PASSED
range set_union PASSED
range sliced PASSED
range sliced_example PASSED
range sort PASSED
range stable_partition PASSED
range stable_sort PASSED
range std_container PASSED
range strided PASSED
range strided2 PASSED
range strided_example PASSED
range string PASSED
range sub_range PASSED
range swap_ranges PASSED
range ticket_5486 PASSED
range ticket_5544_terminate_irange PASSED
range ticket_5547 PASSED
range ticket_5556_is_sorted_namespace PASSED
range ticket_6944 PASSED
range tokenized PASSED
range tokenized_example PASSED
range transform PASSED
range transformed PASSED
range transformed_example PASSED
range type_erased PASSED
range type_erased_example PASSED
range unique PASSED
range unique_copy PASSED
range uniqued PASSED
range uniqued_example PASSED
range upper_bound PASSED
ratio display_ex PASSED
ratio mpl_abs_pass PASSED
ratio mpl_arithmetic_pass PASSED
ratio mpl_comparison_pass PASSED
ratio mpl_divides_pass PASSED
ratio mpl_equal_to_pass PASSED
ratio mpl_greater_equal_pass PASSED
ratio mpl_greater_pass PASSED
ratio mpl_less_equal_pass PASSED
ratio mpl_less_pass PASSED
ratio mpl_minus_pass PASSED
ratio mpl_negate_pass PASSED
ratio mpl_not_equal_to_pass PASSED
ratio mpl_plus_pass PASSED
ratio mpl_rational_constant_pass PASSED
ratio mpl_sign_pass PASSED
ratio mpl_times_pass PASSED
ratio ratio1_fail PASSED
ratio ratio2_fail PASSED
ratio ratio3_fail PASSED
ratio ratio4_fail PASSED
ratio ratio_add_2_fail PASSED
ratio ratio_add_3_fail PASSED
ratio ratio_add_fail PASSED
ratio ratio_add_pass PASSED
ratio ratio_divide_fail PASSED
ratio ratio_divide_pass PASSED
ratio ratio_equal_pass PASSED
ratio ratio_ext_pass PASSED
ratio ratio_greater_equal_pass PASSED
ratio ratio_greater_pass PASSED
ratio ratio_io_fail PASSED
ratio ratio_io_pass PASSED
ratio ratio_less_equal_pass PASSED
ratio ratio_less_pass PASSED
ratio ratio_multiply_fail PASSED
ratio ratio_multiply_pass PASSED
ratio ratio_not_equal_pass PASSED
ratio ratio_pass PASSED
ratio ratio_subtract_fail PASSED
ratio ratio_subtract_pass PASSED
ratio si_physics PASSED
ratio typedefs_pass PASSED
rational rational_example PASSED
rational rational_test PASSED
regex bad_expression_test PASSED
regex captures_example PASSED
regex captures_test PASSED
regex concept_check PASSED
regex credit_card_example PASSED
regex icu_concept_check PASSED
regex icu_example PASSED
regex mfc_example PASSED
regex named_subexpressions_test PASSED
regex object_cache_test PASSED
regex partial_regex_grep PASSED
regex partial_regex_iterate PASSED
regex partial_regex_match PASSED
regex posix_api_check PASSED
regex posix_api_check_cpp PASSED
regex recursion_test PASSED
regex regex_config_info PASSED
regex regex_dll_config_info PASSED
regex regex_grep_example_1 PASSED
regex regex_grep_example_2 PASSED
regex regex_grep_example_3 PASSED
regex regex_grep_example_4 PASSED
regex regex_iterator_example PASSED
regex regex_match_example PASSED
regex regex_merge_example PASSED
regex regex_regress_threaded PASSED
regex regex_replace_example PASSED
regex regex_search_example PASSED
regex regex_split_example_1 PASSED
regex regex_split_example_2 PASSED
regex regex_timer PASSED
regex regex_token_iterator_eg_1 PASSED
regex regex_token_iterator_eg_2 PASSED
regex static_mutex_test PASSED
regex test_collate_info PASSED
regex test_consolidated PASSED
regex test_grep PASSED
regex unicode_iterator_test_utf16 PASSED
regex unicode_iterator_test_utf8 PASSED
regex wide_posix_api_check_c PASSED
regex wide_posix_api_check_cpp PASSED
regex regex_regress FAILED
regex regex_regress_noeh FAILED
regex regex_regress_recursive FAILED
scope_exit emulation PASSED
scope_exit emulation_const_error PASSED
scope_exit emulation_cv_error PASSED
scope_exit emulation_this PASSED
scope_exit emulation_this_tpl PASSED
scope_exit emulation_tpl PASSED
scope_exit emulation_tu_test PASSED
scope_exit native PASSED
scope_exit native_const_error PASSED
scope_exit native_cv_error PASSED
scope_exit native_this PASSED
scope_exit native_this_tpl PASSED
scope_exit native_tpl PASSED
scope_exit native_tu_test PASSED
scope_exit same_line PASSED
scope_exit same_line_seq PASSED
scope_exit same_line_seq_nova PASSED
scope_exit world PASSED
scope_exit world_checkpoint PASSED
scope_exit world_checkpoint_seq PASSED
scope_exit world_checkpoint_seq_nova PASSED
scope_exit world_seq PASSED
scope_exit world_seq_nova PASSED
scope_exit world_this PASSED
scope_exit world_this_seq PASSED
scope_exit world_this_seq_nova PASSED
scope_exit world_tpl PASSED
scope_exit world_tpl_seq PASSED
scope_exit world_tpl_seq_nova PASSED
scope_exit world_void PASSED
scope_exit world_void_nova PASSED
scope_exit world_checkpoint_all FAILED
scope_exit world_checkpoint_all_seq FAILED
scope_exit world_checkpoint_all_seq_nova FAILED
serialization test_array_binary_archive PASSED
serialization test_array_text_archive PASSED
serialization test_array_text_warchive PASSED
serialization test_array_xml_archive PASSED
serialization test_array_xml_warchive PASSED
serialization test_binary_binary_archive PASSED
serialization test_binary_text_archive PASSED
serialization test_binary_text_warchive PASSED
serialization test_binary_xml_archive PASSED
serialization test_binary_xml_warchive PASSED
serialization test_bitset_binary_archive PASSED
serialization test_bitset_text_archive PASSED
serialization test_bitset_text_warchive PASSED
serialization test_bitset_xml_archive PASSED
serialization test_bitset_xml_warchive PASSED
serialization test_check PASSED
serialization test_class_info_load_binary_archive PASSED
serialization test_class_info_load_text_archive PASSED
serialization test_class_info_load_text_warchive PASSED
serialization test_class_info_load_xml_archive PASSED
serialization test_class_info_load_xml_warchive PASSED
serialization test_class_info_save_binary_archive PASSED
serialization test_class_info_save_text_archive PASSED
serialization test_class_info_save_text_warchive PASSED
serialization test_class_info_save_xml_archive PASSED
serialization test_class_info_save_xml_warchive PASSED
serialization test_codecvt_null PASSED
serialization test_complex_binary_archive PASSED
serialization test_complex_text_archive PASSED
serialization test_complex_text_warchive PASSED
serialization test_complex_xml_archive PASSED
serialization test_complex_xml_warchive PASSED
serialization test_const_load_fail1 PASSED
serialization test_const_load_fail1_nvp PASSED
serialization test_const_load_fail2 PASSED
serialization test_const_load_fail2_nvp PASSED
serialization test_const_load_fail3 PASSED
serialization test_const_load_fail3_nvp PASSED
serialization test_const_pass PASSED
serialization test_const_save_warn1 PASSED
serialization test_const_save_warn2 PASSED
serialization test_const_save_warn3 PASSED
serialization test_contained_class_binary_archive PASSED
serialization test_contained_class_text_archive PASSED
serialization test_contained_class_text_warchive PASSED
serialization test_contained_class_xml_archive PASSED
serialization test_contained_class_xml_warchive PASSED
serialization test_cyclic_ptrs_binary_archive PASSED
serialization test_cyclic_ptrs_text_archive PASSED
serialization test_cyclic_ptrs_text_warchive PASSED
serialization test_cyclic_ptrs_xml_archive PASSED
serialization test_cyclic_ptrs_xml_warchive PASSED
serialization test_delete_pointer_binary_archive PASSED
serialization test_delete_pointer_text_archive PASSED
serialization test_delete_pointer_text_warchive PASSED
serialization test_delete_pointer_xml_archive PASSED
serialization test_delete_pointer_xml_warchive PASSED
serialization test_deque_binary_archive PASSED
serialization test_deque_text_archive PASSED
serialization test_deque_text_warchive PASSED
serialization test_deque_xml_archive PASSED
serialization test_deque_xml_warchive PASSED
serialization test_derived_binary_archive PASSED
serialization test_derived_class_binary_archive PASSED
serialization test_derived_class_ptr_binary_archive PASSED
serialization test_derived_class_ptr_text_archive PASSED
serialization test_derived_class_ptr_text_warchive PASSED
serialization test_derived_class_ptr_xml_archive PASSED
serialization test_derived_class_ptr_xml_warchive PASSED
serialization test_derived_class_text_archive PASSED
serialization test_derived_class_text_warchive PASSED
serialization test_derived_class_xml_archive PASSED
serialization test_derived_class_xml_warchive PASSED
serialization test_derived_text_archive PASSED
serialization test_derived_text_warchive PASSED
serialization test_derived_xml_archive PASSED
serialization test_derived_xml_warchive PASSED
serialization test_diamond_binary_archive PASSED
serialization test_diamond_complex_binary_archive PASSED
serialization test_diamond_complex_text_archive PASSED
serialization test_diamond_complex_text_warchive PASSED
serialization test_diamond_complex_xml_archive PASSED
serialization test_diamond_complex_xml_warchive PASSED
serialization test_diamond_text_archive PASSED
serialization test_diamond_text_warchive PASSED
serialization test_diamond_xml_archive PASSED
serialization test_diamond_xml_warchive PASSED
serialization test_dll_exported PASSED
serialization test_dll_plugin PASSED
serialization test_dll_simple PASSED
serialization test_exported_binary_archive PASSED
serialization test_exported_text_archive PASSED
serialization test_exported_text_warchive PASSED
serialization test_exported_xml_archive PASSED
serialization test_exported_xml_warchive PASSED
serialization test_inclusion PASSED
serialization test_iterators PASSED
serialization test_iterators_base64 PASSED
serialization test_list_binary_archive PASSED
serialization test_list_ptrs_binary_archive PASSED
serialization test_list_ptrs_text_archive PASSED
serialization test_list_ptrs_text_warchive PASSED
serialization test_list_ptrs_xml_archive PASSED
serialization test_list_ptrs_xml_warchive PASSED
serialization test_list_text_archive PASSED
serialization test_list_text_warchive PASSED
serialization test_list_xml_archive PASSED
serialization test_list_xml_warchive PASSED
serialization test_map_binary_archive PASSED
serialization test_map_text_archive PASSED
serialization test_map_text_warchive PASSED
serialization test_map_xml_archive PASSED
serialization test_map_xml_warchive PASSED
serialization test_mi_binary_archive PASSED
serialization test_mi_text_archive PASSED
serialization test_mi_text_warchive PASSED
serialization test_mi_xml_archive PASSED
serialization test_mi_xml_warchive PASSED
serialization test_mult_archive_types PASSED
serialization test_multiple_inheritance_binary_archive PASSED
serialization test_multiple_inheritance_text_archive PASSED
serialization test_multiple_inheritance_text_warchive PASSED
serialization test_multiple_inheritance_xml_archive PASSED
serialization test_multiple_inheritance_xml_warchive PASSED
serialization test_multiple_ptrs_binary_archive PASSED
serialization test_multiple_ptrs_text_archive PASSED
serialization test_multiple_ptrs_text_warchive PASSED
serialization test_multiple_ptrs_xml_archive PASSED
serialization test_multiple_ptrs_xml_warchive PASSED
serialization test_new_operator_binary_archive PASSED
serialization test_new_operator_text_archive PASSED
serialization test_new_operator_text_warchive PASSED
serialization test_new_operator_xml_archive PASSED
serialization test_new_operator_xml_warchive PASSED
serialization test_no_rtti_binary_archive PASSED
serialization test_no_rtti_text_archive PASSED
serialization test_no_rtti_text_warchive PASSED
serialization test_no_rtti_xml_archive PASSED
serialization test_no_rtti_xml_warchive PASSED
serialization test_non_default_ctor2_binary_archive PASSED
serialization test_non_default_ctor2_text_archive PASSED
serialization test_non_default_ctor2_text_warchive PASSED
serialization test_non_default_ctor2_xml_archive PASSED
serialization test_non_default_ctor2_xml_warchive PASSED
serialization test_non_default_ctor_binary_archive PASSED
serialization test_non_default_ctor_text_archive PASSED
serialization test_non_default_ctor_text_warchive PASSED
serialization test_non_default_ctor_xml_archive PASSED
serialization test_non_default_ctor_xml_warchive PASSED
serialization test_non_intrusive_binary_archive PASSED
serialization test_non_intrusive_text_archive PASSED
serialization test_non_intrusive_text_warchive PASSED
serialization test_non_intrusive_xml_archive PASSED
serialization test_non_intrusive_xml_warchive PASSED
serialization test_not_serializable PASSED
serialization test_null_ptr_binary_archive PASSED
serialization test_null_ptr_text_archive PASSED
serialization test_null_ptr_text_warchive PASSED
serialization test_null_ptr_xml_archive PASSED
serialization test_null_ptr_xml_warchive PASSED
serialization test_nvp_binary_archive PASSED
serialization test_nvp_text_archive PASSED
serialization test_nvp_text_warchive PASSED
serialization test_nvp_xml_archive PASSED
serialization test_nvp_xml_warchive PASSED
serialization test_object_binary_archive PASSED
serialization test_object_text_archive PASSED
serialization test_object_text_warchive PASSED
serialization test_object_xml_archive PASSED
serialization test_object_xml_warchive PASSED
serialization test_optional_binary_archive PASSED
serialization test_optional_text_archive PASSED
serialization test_optional_text_warchive PASSED
serialization test_optional_xml_archive PASSED
serialization test_optional_xml_warchive PASSED
serialization test_polymorphic2_polymorphic_binary_archive PASSED
serialization test_polymorphic2_polymorphic_text_archive PASSED
serialization test_polymorphic2_polymorphic_text_warchive PASSED
serialization test_polymorphic2_polymorphic_xml_archive PASSED
serialization test_polymorphic2_polymorphic_xml_warchive PASSED
serialization test_polymorphic_polymorphic_binary_archive PASSED
serialization test_polymorphic_polymorphic_text_archive PASSED
serialization test_polymorphic_polymorphic_text_warchive PASSED
serialization test_polymorphic_polymorphic_xml_archive PASSED
serialization test_polymorphic_polymorphic_xml_warchive PASSED
serialization test_primitive_binary_archive PASSED
serialization test_primitive_text_archive PASSED
serialization test_primitive_text_warchive PASSED
serialization test_primitive_xml_archive PASSED
serialization test_primitive_xml_warchive PASSED
serialization test_private_ctor PASSED
serialization test_recursion_binary_archive PASSED
serialization test_recursion_text_archive PASSED
serialization test_recursion_text_warchive PASSED
serialization test_recursion_xml_archive PASSED
serialization test_recursion_xml_warchive PASSED
serialization test_registered_binary_archive PASSED
serialization test_registered_text_archive PASSED
serialization test_registered_text_warchive PASSED
serialization test_registered_xml_archive PASSED
serialization test_registered_xml_warchive PASSED
serialization test_reset_object_address PASSED
serialization test_set_binary_archive PASSED
serialization test_set_text_archive PASSED
serialization test_set_text_warchive PASSED
serialization test_set_xml_archive PASSED
serialization test_set_xml_warchive PASSED
serialization test_shared_ptr_132_binary_archive PASSED
serialization test_shared_ptr_132_text_archive PASSED
serialization test_shared_ptr_132_text_warchive PASSED
serialization test_shared_ptr_132_xml_archive PASSED
serialization test_shared_ptr_132_xml_warchive PASSED
serialization test_shared_ptr_binary_archive PASSED
serialization test_shared_ptr_multi_base_binary_archive PASSED
serialization test_shared_ptr_multi_base_text_archive PASSED
serialization test_shared_ptr_multi_base_text_warchive PASSED
serialization test_shared_ptr_multi_base_xml_archive PASSED
serialization test_shared_ptr_multi_base_xml_warchive PASSED
serialization test_shared_ptr_text_archive PASSED
serialization test_shared_ptr_text_warchive PASSED
serialization test_shared_ptr_xml_archive PASSED
serialization test_shared_ptr_xml_warchive PASSED
serialization test_simple_class_binary_archive PASSED
serialization test_simple_class_ptr_binary_archive PASSED
serialization test_simple_class_ptr_text_archive PASSED
serialization test_simple_class_ptr_text_warchive PASSED
serialization test_simple_class_ptr_xml_archive PASSED
serialization test_simple_class_ptr_xml_warchive PASSED
serialization test_simple_class_text_archive PASSED
serialization test_simple_class_text_warchive PASSED
serialization test_simple_class_xml_archive PASSED
serialization test_simple_class_xml_warchive PASSED
serialization test_smart_cast PASSED
serialization test_split_binary_archive PASSED
serialization test_split_text_archive PASSED
serialization test_split_text_warchive PASSED
serialization test_split_xml_archive PASSED
serialization test_split_xml_warchive PASSED
serialization test_static_warning PASSED
serialization test_tracking_binary_archive PASSED
serialization test_tracking_text_archive PASSED
serialization test_tracking_text_warchive PASSED
serialization test_tracking_xml_archive PASSED
serialization test_tracking_xml_warchive PASSED
serialization test_traits_fail PASSED
serialization test_traits_pass PASSED
serialization test_unregistered_binary_archive PASSED
serialization test_unregistered_text_archive PASSED
serialization test_unregistered_text_warchive PASSED
serialization test_unregistered_xml_archive PASSED
serialization test_unregistered_xml_warchive PASSED
serialization test_utf8_codecvt PASSED
serialization test_valarray_binary_archive PASSED
serialization test_valarray_text_archive PASSED
serialization test_valarray_text_warchive PASSED
serialization test_valarray_xml_archive PASSED
serialization test_valarray_xml_warchive PASSED
serialization test_variant_binary_archive PASSED
serialization test_variant_text_archive PASSED
serialization test_variant_text_warchive PASSED
serialization test_variant_xml_archive PASSED
serialization test_variant_xml_warchive PASSED
serialization test_vector_binary_archive PASSED
serialization test_vector_text_archive PASSED
serialization test_vector_text_warchive PASSED
serialization test_vector_xml_archive PASSED
serialization test_vector_xml_warchive PASSED
serialization test_void_cast PASSED
signals dead_slot_test PASSED
signals deletion_test PASSED
signals ordering_test PASSED
signals signal_n_test PASSED
signals signal_test PASSED
signals swap_test PASSED
signals trackable_test PASSED
signals2 connection_test PASSED
signals2 dead_slot_test PASSED
signals2 deconstruct_test PASSED
signals2 deletion_test PASSED
signals2 mutex_test PASSED
signals2 ordering_test PASSED
signals2 regression_test PASSED
signals2 shared_connection_block_test PASSED
signals2 signal_n_test PASSED
signals2 signal_test PASSED
signals2 signal_type_test PASSED
signals2 slot_compile_test PASSED
signals2 threading_models_test PASSED
signals2 track_test PASSED
signals2 trackable_test PASSED
smart_ptr allocate_shared_array_args_test PASSED
smart_ptr allocate_shared_array_create_test PASSED
smart_ptr allocate_shared_array_esft_test PASSED
smart_ptr allocate_shared_array_init_test PASSED
smart_ptr allocate_shared_array_test PASSED
smart_ptr allocate_shared_array_throws_test PASSED
smart_ptr allocate_shared_arrays_create_test PASSED
smart_ptr allocate_shared_arrays_init_test PASSED
smart_ptr allocate_shared_arrays_test PASSED
smart_ptr allocate_shared_esft_test PASSED
smart_ptr allocate_shared_test PASSED
smart_ptr array_fail_ap_spa_a PASSED
smart_ptr array_fail_ap_spa_c PASSED
smart_ptr array_fail_ap_spa_ma PASSED
smart_ptr array_fail_ap_spa_mc PASSED
smart_ptr array_fail_array_access PASSED
smart_ptr array_fail_dereference PASSED
smart_ptr array_fail_member_access PASSED
smart_ptr array_fail_sp_spa_a PASSED
smart_ptr array_fail_sp_spa_c PASSED
smart_ptr array_fail_sp_spa_ma PASSED
smart_ptr array_fail_sp_spa_mc PASSED
smart_ptr array_fail_sp_wpa_a PASSED
smart_ptr array_fail_sp_wpa_c PASSED
smart_ptr array_fail_sp_wpa_ma PASSED
smart_ptr array_fail_sp_wpa_mc PASSED
smart_ptr array_fail_spa_sp_a PASSED
smart_ptr array_fail_spa_sp_c PASSED
smart_ptr array_fail_spa_sp_ma PASSED
smart_ptr array_fail_spa_sp_mc PASSED
smart_ptr array_fail_spa_spa_a PASSED
smart_ptr array_fail_spa_spa_c PASSED
smart_ptr array_fail_spa_spa_ma PASSED
smart_ptr array_fail_spa_spa_mc PASSED
smart_ptr array_fail_spa_wp_a PASSED
smart_ptr array_fail_spa_wp_c PASSED
smart_ptr array_fail_spa_wp_ma PASSED
smart_ptr array_fail_spa_wp_mc PASSED
smart_ptr array_fail_spa_wpa_a PASSED
smart_ptr array_fail_spa_wpa_c PASSED
smart_ptr array_fail_spa_wpa_ma PASSED
smart_ptr array_fail_spa_wpa_mc PASSED
smart_ptr array_fail_up_spa_a PASSED
smart_ptr array_fail_up_spa_c PASSED
smart_ptr array_fail_up_spa_ma PASSED
smart_ptr array_fail_up_spa_mc PASSED
smart_ptr array_fail_upa_sp_a PASSED
smart_ptr array_fail_upa_sp_c PASSED
smart_ptr array_fail_upa_sp_ma PASSED
smart_ptr array_fail_upa_sp_mc PASSED
smart_ptr array_fail_wp_wpa_a PASSED
smart_ptr array_fail_wp_wpa_c PASSED
smart_ptr array_fail_wp_wpa_ma PASSED
smart_ptr array_fail_wp_wpa_mc PASSED
smart_ptr array_fail_wpa_wp_a PASSED
smart_ptr array_fail_wpa_wp_c PASSED
smart_ptr array_fail_wpa_wp_ma PASSED
smart_ptr array_fail_wpa_wp_mc PASSED
smart_ptr array_fail_wpa_wpa_a PASSED
smart_ptr array_fail_wpa_wpa_c PASSED
smart_ptr array_fail_wpa_wpa_ma PASSED
smart_ptr array_fail_wpa_wpa_mc PASSED
smart_ptr atomic_count_test PASSED
smart_ptr atomic_count_test2 PASSED
smart_ptr auto_ptr_lv_fail PASSED
smart_ptr auto_ptr_rv_test PASSED
smart_ptr enable_shared_from_raw_test PASSED
smart_ptr esft_constructor_test PASSED
smart_ptr esft_regtest PASSED
smart_ptr esft_second_ptr_test PASSED
smart_ptr esft_void_test PASSED
smart_ptr get_deleter_array_test PASSED
smart_ptr get_deleter_test PASSED
smart_ptr intrusive_ptr_move_test PASSED
smart_ptr intrusive_ptr_test PASSED
smart_ptr intrusive_ref_counter_test PASSED
smart_ptr ip_convertible_test PASSED
smart_ptr ip_hash_test PASSED
smart_ptr lw_mutex_test PASSED
smart_ptr make_shared_array_args_test PASSED
smart_ptr make_shared_array_create_test PASSED
smart_ptr make_shared_array_esft_test PASSED
smart_ptr make_shared_array_init_test PASSED
smart_ptr make_shared_array_test PASSED
smart_ptr make_shared_array_throws_test PASSED
smart_ptr make_shared_arrays_create_test PASSED
smart_ptr make_shared_arrays_init_test PASSED
smart_ptr make_shared_arrays_test PASSED
smart_ptr make_shared_esft_test PASSED
smart_ptr make_shared_fp_test PASSED
smart_ptr make_shared_perfect_forwarding_test PASSED
smart_ptr make_shared_test PASSED
smart_ptr owner_less_test PASSED
smart_ptr pointer_cast_test PASSED
smart_ptr pointer_to_other_test PASSED
smart_ptr scoped_array_eq_fail PASSED
smart_ptr scoped_ptr_eq_fail PASSED
smart_ptr shared_from_this_test PASSED
smart_ptr shared_ptr_alias_test PASSED
smart_ptr shared_ptr_alloc2_test PASSED
smart_ptr shared_ptr_assign_fail PASSED
smart_ptr shared_ptr_basic_test PASSED
smart_ptr shared_ptr_compare_fail PASSED
smart_ptr shared_ptr_convertible_test PASSED
smart_ptr shared_ptr_delete_fail PASSED
smart_ptr shared_ptr_move_test PASSED
smart_ptr shared_ptr_pv_fail PASSED
smart_ptr shared_ptr_rv_test PASSED
smart_ptr shared_ptr_test PASSED
smart_ptr smart_ptr_test PASSED
smart_ptr sp_array_cast_test PASSED
smart_ptr sp_array_cv_test PASSED
smart_ptr sp_array_n_test PASSED
smart_ptr sp_array_test PASSED
smart_ptr sp_atomic_test PASSED
smart_ptr sp_convertible_test PASSED
smart_ptr sp_hash_test PASSED
smart_ptr sp_nullptr_test PASSED
smart_ptr sp_recursive_assign2_rv_test PASSED
smart_ptr sp_recursive_assign2_test PASSED
smart_ptr sp_recursive_assign_rv_test PASSED
smart_ptr sp_recursive_assign_test PASSED
smart_ptr sp_typeinfo_test PASSED
smart_ptr sp_unary_addr_test PASSED
smart_ptr sp_unique_ptr_test PASSED
smart_ptr sp_zero_compare_test PASSED
smart_ptr spinlock_pool_test PASSED
smart_ptr spinlock_test PASSED
smart_ptr spinlock_try_test PASSED
smart_ptr spinlock_try_test~mt PASSED
smart_ptr weak_ptr_move_test PASSED
smart_ptr weak_ptr_test PASSED
smart_ptr wp_convertible_test PASSED
smart_ptr yield_k_test PASSED
smart_ptr yield_k_test~mt PASSED
spirit action_tests PASSED
spirit action_tests_debug PASSED
spirit ast_calc_tests PASSED
spirit ast_calc_tests_debug PASSED
spirit bug_000008 PASSED
spirit bug_fixes PASSED
spirit bug_fixes_debug PASSED
spirit char_strings_test PASSED
spirit char_strings_test_debug PASSED
spirit char_strings_test_fail PASSED
spirit chset_tests PASSED
spirit chset_tests_debug PASSED
spirit closure_tests PASSED
spirit closure_tests_debug PASSED
spirit confix_tests PASSED
spirit confix_tests_debug PASSED
spirit custom_real_parser PASSED
spirit custom_real_parser_debug PASSED
spirit directives_tests PASSED
spirit directives_tests_debug PASSED
spirit distinct_tests PASSED
spirit distinct_tests_debug PASSED
spirit epsilon_tests PASSED
spirit epsilon_tests_debug PASSED
spirit escape_char_parser_tests PASSED
spirit escape_char_parser_tests_debug PASSED
spirit exception_tests PASSED
spirit exception_tests_debug PASSED
spirit file_iterator_tests PASSED
spirit file_iterator_tests_debug PASSED
spirit fixed_size_queue_fail_tests PASSED
spirit fixed_size_queue_tests PASSED
spirit fixed_size_queue_tests_debug PASSED
spirit for_p_as_parser_tests PASSED
spirit for_tests PASSED
spirit for_tests_debug PASSED
spirit fundamental_tests PASSED
spirit fundamental_tests_debug PASSED
spirit grammar_def_test PASSED
spirit grammar_def_test_debug PASSED
spirit grammar_mt_tests PASSED
spirit grammar_multi_instance_tst PASSED
spirit grammar_multi_instance_tst_debug PASSED
spirit grammar_tests PASSED
spirit grammar_tests_debug PASSED
spirit group_match_bug PASSED
spirit group_match_bug_debug PASSED
spirit if_p_as_parser_tests PASSED
spirit if_p_int_as_condition_test PASSED
spirit if_p_int_as_condition_test_debug PASSED
spirit if_tests PASSED
spirit if_tests_debug PASSED
spirit karma_actions-p3 PASSED
spirit karma_alternative2-p3 PASSED
spirit karma_and_predicate-p3 PASSED
spirit karma_attribute-p3 PASSED
spirit karma_auto1-p3 PASSED
spirit karma_auto2-p3 PASSED
spirit karma_auto3-p3 PASSED
spirit karma_bool-p3 PASSED
spirit karma_buffer-p3 PASSED
spirit karma_case_handling1-p3 PASSED
spirit karma_case_handling2-p3 PASSED
spirit karma_case_handling3-p3 PASSED
spirit karma_center_alignment-p3 PASSED
spirit karma_char1-p3 PASSED
spirit karma_char2-p3 PASSED
spirit karma_char3-p3 PASSED
spirit karma_char_class-p3 PASSED
spirit karma_columns-p3 PASSED
spirit karma_debug-p3 PASSED
spirit karma_delimiter-p3 PASSED
spirit karma_duplicate-p3 PASSED
spirit karma_encoding-p3 PASSED
spirit karma_eol-p3 PASSED
spirit karma_eps-p3 PASSED
spirit karma_format_manip-p3 PASSED
spirit karma_format_manip_attr-p3 PASSED
spirit karma_format_pointer_container-p3 PASSED
spirit karma_generate_attr-p3 PASSED
spirit karma_grammar-p3 PASSED
spirit karma_grammar_fail-p3 PASSED
spirit karma_int1-p3 PASSED
spirit karma_int2-p3 PASSED
spirit karma_int3-p3 PASSED
spirit karma_kleene-p3 PASSED
spirit karma_lazy-p3 PASSED
spirit karma_left_alignment-p3 PASSED
spirit karma_list-p3 PASSED
spirit karma_lit-p3 PASSED
spirit karma_maxwidth-p3 PASSED
spirit karma_not_predicate-p3 PASSED
spirit karma_omit-p3 PASSED
spirit karma_optional-p3 PASSED
spirit karma_pattern1-p3 PASSED
spirit karma_pattern2-p3 PASSED
spirit karma_pattern3-p3 PASSED
spirit karma_pattern4-p3 PASSED
spirit karma_plus-p3 PASSED
spirit karma_real3-p3 PASSED
spirit karma_regression_adapt_adt-p3 PASSED
spirit karma_regression_center_alignment-p3 PASSED
spirit karma_regression_iterator-p3 PASSED
spirit karma_regression_optional_double-p3 PASSED
spirit karma_regression_real_0-p3 PASSED
spirit karma_regression_real_scientific-p3 PASSED
spirit karma_regression_semantic_action_attribute-p3 PASSED
spirit karma_repeat1-p3 PASSED
spirit karma_repeat2-p3 PASSED
spirit karma_repo_confix PASSED
spirit karma_right_alignment-p3 PASSED
spirit karma_rule_fail-p3 PASSED
spirit karma_sequence1-p3 PASSED
spirit karma_sequence2-p3 PASSED
spirit karma_stream-p3 PASSED
spirit karma_symbols1-p3 PASSED
spirit karma_symbols2-p3 PASSED
spirit karma_symbols3-p3 PASSED
spirit karma_tricky_alignment-p3 PASSED
spirit karma_uint_radix-p3 PASSED
spirit karma_utree1-p3 PASSED
spirit karma_utree2-p3 PASSED
spirit karma_utree3-p3 PASSED
spirit karma_wstream-p3 PASSED
spirit lazy_tests PASSED
spirit lazy_tests_debug PASSED
spirit lex_auto_switch_lexerstate-p3 PASSED
spirit lex_dedent_handling_phoenix-p3 PASSED
spirit lex_id_type_enum-p3 PASSED
spirit lex_lexer_state_switcher-p3 PASSED
spirit lex_lexertl1-p3 PASSED
spirit lex_lexertl2-p3 PASSED
spirit lex_lexertl3-p3 PASSED
spirit lex_lexertl4-p3 PASSED
spirit lex_lexertl5-p3 PASSED
spirit lex_regression_basic_lexer-p3 PASSED
spirit lex_regression_file_iterator1-p3 PASSED
spirit lex_regression_file_iterator2-p3 PASSED
spirit lex_regression_file_iterator3-p3 PASSED
spirit lex_regression_file_iterator4-p3 PASSED
spirit lex_regression_matlib_dynamic-p3 PASSED
spirit lex_regression_syntax_error-p3 PASSED
spirit lex_regression_wide-p3 PASSED
spirit lex_regression_word_count-p3 PASSED
spirit lex_semantic_actions-p3 PASSED
spirit lex_set_token_value-p3 PASSED
spirit lex_set_token_value_phoenix-p3 PASSED
spirit lex_state_switcher-p3 PASSED
spirit lex_string_token_id-p3 PASSED
spirit lex_token_iterpair-p3 PASSED
spirit lex_token_moretypes-p3 PASSED
spirit lex_token_omit-p3 PASSED
spirit lex_token_onetype-p3 PASSED
spirit loops_tests PASSED
spirit loops_tests_debug PASSED
spirit match_tests PASSED
spirit match_tests_debug PASSED
spirit mix_and_match_trees PASSED
spirit multi_pass_compile_tests PASSED
spirit multi_pass_tests PASSED
spirit multi_pass_tests_debug PASSED
spirit negated_eps_p_test PASSED
spirit negated_eps_p_test_debug PASSED
spirit numerics_tests PASSED
spirit numerics_tests_debug PASSED
spirit operators_tests PASSED
spirit operators_tests_debug PASSED
spirit owi_mt_tests PASSED
spirit owi_st_tests PASSED
spirit owi_st_tests_debug PASSED
spirit parametric_tests PASSED
spirit parametric_tests_debug PASSED
spirit parser_context_test PASSED
spirit parser_context_test_debug PASSED
spirit parser_traits_tests PASSED
spirit parser_traits_tests_debug PASSED
spirit position_iterator_tests PASSED
spirit position_iterator_tests_debug PASSED
spirit post_skips PASSED
spirit post_skips_debug PASSED
spirit primitives_tests PASSED
spirit primitives_tests_debug PASSED
spirit qi_actions-p3 PASSED
spirit qi_actions2-p3 PASSED
spirit qi_alternative-p3 PASSED
spirit qi_and_predicate-p3 PASSED
spirit qi_attr-p3 PASSED
spirit qi_attribute1-p3 PASSED
spirit qi_attribute2-p3 PASSED
spirit qi_auto-p3 PASSED
spirit qi_bool1-p3 PASSED
spirit qi_bool2-p3 PASSED
spirit qi_char1-p3 PASSED
spirit qi_char2-p3 PASSED
spirit qi_char_class-p3 PASSED
spirit qi_debug-p3 PASSED
spirit qi_difference-p3 PASSED
spirit qi_encoding-p3 PASSED
spirit qi_end-p3 PASSED
spirit qi_eps-p3 PASSED
spirit qi_expect-p3 PASSED
spirit qi_grammar-p3 PASSED
spirit qi_hold-p3 PASSED
spirit qi_int1-p3 PASSED
spirit qi_int2-p3 PASSED
spirit qi_int3-p3 PASSED
spirit qi_kleene-p3 PASSED
spirit qi_lazy-p3 PASSED
spirit qi_lexeme-p3 PASSED
spirit qi_list-p3 PASSED
spirit qi_lit1-p3 PASSED
spirit qi_lit2-p3 PASSED
spirit qi_match_manip1-p3 PASSED
spirit qi_match_manip2-p3 PASSED
spirit qi_match_manip3-p3 PASSED
spirit qi_match_manip_attr-p3 PASSED
spirit qi_matches-p3 PASSED
spirit qi_no_case-p3 PASSED
spirit qi_not_predicate-p3 PASSED
spirit qi_optional-p3 PASSED
spirit qi_parse_attr-p3 PASSED
spirit qi_pass_container1-p3 PASSED
spirit qi_pass_container2-p3 PASSED
spirit qi_pass_container3-p3 PASSED
spirit qi_permutation-p3 PASSED
spirit qi_plus-p3 PASSED
spirit qi_range_run-p3 PASSED
spirit qi_raw-p3 PASSED
spirit qi_real1-p3 PASSED
spirit qi_real2-p3 PASSED
spirit qi_real3-p3 PASSED
spirit qi_real4-p3 PASSED
spirit qi_real5-p3 PASSED
spirit qi_regression_adapt_adt-p3 PASSED
spirit qi_regression_attr_with_action-p3 PASSED
spirit qi_regression_binary_action-p3 PASSED
spirit qi_regression_clear-p3 PASSED
spirit qi_regression_container_attribute-p3 PASSED
spirit qi_regression_debug_optional-p3 PASSED
spirit qi_regression_fusion_proto_spirit-p3 PASSED
spirit qi_regression_numeric_alternatives-p3 PASSED
spirit qi_regression_one_element_fusion_sequence-p3 PASSED
spirit qi_regression_one_element_sequence_attribute-p3 PASSED
spirit qi_regression_reorder-p3 PASSED
spirit qi_regression_transform_assignment-p3 PASSED
spirit qi_repeat-p3 PASSED
spirit qi_repo_advance PASSED
spirit qi_repo_confix PASSED
spirit qi_repo_distinct PASSED
spirit qi_repo_seek PASSED
spirit qi_rule1-p3 PASSED
spirit qi_rule3-p3 PASSED
spirit qi_rule4-p3 PASSED
spirit qi_sequence-p3 PASSED
spirit qi_sequential_or-p3 PASSED
spirit qi_skip-p3 PASSED
spirit qi_stream-p3 PASSED
spirit qi_symbols1-p3 PASSED
spirit qi_symbols2-p3 PASSED
spirit qi_tst-p3 PASSED
spirit qi_uint1-p3 PASSED
spirit qi_uint2-p3 PASSED
spirit qi_uint3-p3 PASSED
spirit qi_uint_radix-p3 PASSED
spirit qi_utree2-p3 PASSED
spirit qi_utree4-p3 PASSED
spirit regression_const_real_policies-p3 PASSED
spirit regression_less_8563-p3 PASSED
spirit regression_multi_pass_error_handler-p3 PASSED
spirit regression_static_wide_6253-p3 PASSED
spirit repeat_ast_tests PASSED
spirit repeat_ast_tests_debug PASSED
spirit rule_tests PASSED
spirit rule_tests_debug PASSED
spirit scanner_tests PASSED
spirit scanner_tests_debug PASSED
spirit scanner_value_type_tests PASSED
spirit scanner_value_type_tests_debug PASSED
spirit scoped_lock_tests PASSED
spirit scoped_lock_tests_debug PASSED
spirit select_p_with_rule PASSED
spirit select_p_with_rule_debug PASSED
spirit sf_bug_720917 PASSED
spirit sf_bug_720917_debug PASSED
spirit shortest_alternative_tests PASSED
spirit shortest_alternative_tests_debug PASSED
spirit subrule_tests PASSED
spirit subrule_tests_debug PASSED
spirit support_regression_multi_pass_functor-p3 PASSED
spirit support_regression_multi_pass_parse-p3 PASSED
spirit support_regression_multi_pass_position_iterator-p3 PASSED
spirit support_utree-p3 PASSED
spirit support_utree_debug-p3 PASSED
spirit switch_problem PASSED
spirit switch_problem_debug PASSED
spirit switch_tests_eps_default PASSED
spirit switch_tests_eps_default_debug PASSED
spirit switch_tests_general_def PASSED
spirit switch_tests_general_def_debug PASSED
spirit switch_tests_single PASSED
spirit switch_tests_single_debug PASSED
spirit switch_tests_wo_default PASSED
spirit switch_tests_wo_default_debug PASSED
spirit symbols_add_null PASSED
spirit symbols_add_null_debug PASSED
spirit symbols_find_null PASSED
spirit symbols_find_null_debug PASSED
spirit symbols_tests PASSED
spirit symbols_tests_debug PASSED
spirit traverse_tests PASSED
spirit traverse_tests_debug PASSED
spirit tree_to_xml PASSED
spirit tree_to_xml_debug PASSED
spirit typeof_actor PASSED
spirit typeof_attribute PASSED
spirit typeof_core PASSED
spirit typeof_debug PASSED
spirit typeof_dynamic PASSED
spirit typeof_error_handling PASSED
spirit typeof_iterator PASSED
spirit typeof_symbols PASSED
spirit typeof_tree PASSED
spirit typeof_utility PASSED
spirit while_p_as_parser_tests PASSED
spirit while_tests PASSED
spirit while_tests_debug PASSED
spirit karma_alternative1-p3 FAILED
spirit karma_binary1-p3 FAILED
spirit karma_binary2-p3 FAILED
spirit karma_binary3-p3 FAILED
spirit karma_real1-p3 FAILED
spirit karma_real2-p3 FAILED
spirit karma_regression_container_variant_sequence-p3 FAILED
spirit karma_regression_unicode_char-p3 FAILED
spirit karma_repo_subrule FAILED
spirit lex_regression_matlib_generate-p3 FAILED
spirit lex_regression_matlib_generate_switch-p3 FAILED
spirit lex_regression_matlib_static-p3 FAILED
spirit lex_regression_matlib_switch-p3 FAILED
spirit qi_binary-p3 FAILED
spirit qi_no_skip-p3 FAILED
spirit qi_regression_lazy_repeat-p3 FAILED
spirit qi_regression_repeat-p3 FAILED
spirit qi_regression_stream_eof-p3 FAILED
spirit qi_repo_keywords FAILED
spirit qi_repo_subrule FAILED
spirit qi_rule2-p3 FAILED
spirit qi_terminal_ex-p3 FAILED
spirit qi_utree1-p3 FAILED
spirit qi_utree3-p3 FAILED
statechart BitMachineExample PASSED
statechart CameraExample PASSED
statechart CustomReactionTestBoth PASSED
statechart CustomReactionTestNative PASSED
statechart CustomReactionTestNormal PASSED
statechart CustomReactionTestRelaxed PASSED
statechart DeferralBugBoth PASSED
statechart DeferralBugNative PASSED
statechart DeferralBugNormal PASSED
statechart DeferralBugRelaxed PASSED
statechart DeferralTestBoth PASSED
statechart DeferralTestNative PASSED
statechart DeferralTestNormal PASSED
statechart DeferralTestRelaxed PASSED
statechart DllTestNative PASSED
statechart FifoSchedulerTestBoth PASSED
statechart FifoSchedulerTestNative PASSED
statechart FifoSchedulerTestNormal PASSED
statechart FifoSchedulerTestRelaxed PASSED
statechart HandcraftedExample PASSED
statechart HistoryTestBoth PASSED
statechart HistoryTestNative PASSED
statechart HistoryTestNormal PASSED
statechart HistoryTestRelaxed PASSED
statechart InStateReactionTestBoth PASSED
statechart InStateReactionTestNative PASSED
statechart InStateReactionTestNormal PASSED
statechart InStateReactionTestRelaxed PASSED
statechart InconsistentHistoryTest1Both PASSED
statechart InconsistentHistoryTest1Native PASSED
statechart InconsistentHistoryTest1Normal PASSED
statechart InconsistentHistoryTest1Relaxed PASSED
statechart InconsistentHistoryTest2Both PASSED
statechart InconsistentHistoryTest2Native PASSED
statechart InconsistentHistoryTest2Normal PASSED
statechart InconsistentHistoryTest2Relaxed PASSED
statechart InconsistentHistoryTest3Both PASSED
statechart InconsistentHistoryTest3Native PASSED
statechart InconsistentHistoryTest3Normal PASSED
statechart InconsistentHistoryTest3Relaxed PASSED
statechart InconsistentHistoryTest4Both PASSED
statechart InconsistentHistoryTest4Native PASSED
statechart InconsistentHistoryTest4Normal PASSED
statechart InconsistentHistoryTest4Relaxed PASSED
statechart InconsistentHistoryTest5Both PASSED
statechart InconsistentHistoryTest5Native PASSED
statechart InconsistentHistoryTest5Normal PASSED
statechart InconsistentHistoryTest5Relaxed PASSED
statechart InconsistentHistoryTest6Both PASSED
statechart InconsistentHistoryTest6Native PASSED
statechart InconsistentHistoryTest6Normal PASSED
statechart InconsistentHistoryTest6Relaxed PASSED
statechart InconsistentHistoryTest7Both PASSED
statechart InconsistentHistoryTest7Native PASSED
statechart InconsistentHistoryTest7Normal PASSED
statechart InconsistentHistoryTest7Relaxed PASSED
statechart InconsistentHistoryTest8Both PASSED
statechart InconsistentHistoryTest8Native PASSED
statechart InconsistentHistoryTest8Normal PASSED
statechart InconsistentHistoryTest8Relaxed PASSED
statechart InvalidChartTest1Both PASSED
statechart InvalidChartTest1Native PASSED
statechart InvalidChartTest1Normal PASSED
statechart InvalidChartTest1Relaxed PASSED
statechart InvalidChartTest2Both PASSED
statechart InvalidChartTest2Native PASSED
statechart InvalidChartTest2Normal PASSED
statechart InvalidChartTest2Relaxed PASSED
statechart InvalidChartTest3Both PASSED
statechart InvalidChartTest3Native PASSED
statechart InvalidChartTest3Normal PASSED
statechart InvalidChartTest3Relaxed PASSED
statechart InvalidResultAssignTestBoth PASSED
statechart InvalidResultAssignTestNative PASSED
statechart InvalidResultAssignTestNormal PASSED
statechart InvalidResultAssignTestRelaxed PASSED
statechart InvalidResultCopyTestBoth PASSED
statechart InvalidResultCopyTestNative PASSED
statechart InvalidResultCopyTestNormal PASSED
statechart InvalidResultCopyTestRelaxed PASSED
statechart InvalidResultDefCtorTestBoth PASSED
statechart InvalidResultDefCtorTestNative PASSED
statechart InvalidResultDefCtorTestNormal PASSED
statechart InvalidResultDefCtorTestRelaxed PASSED
statechart InvalidTransitionTest1Both PASSED
statechart InvalidTransitionTest1Native PASSED
statechart InvalidTransitionTest1Normal PASSED
statechart InvalidTransitionTest1Relaxed PASSED
statechart InvalidTransitionTest2Both PASSED
statechart InvalidTransitionTest2Native PASSED
statechart InvalidTransitionTest2Normal PASSED
statechart InvalidTransitionTest2Relaxed PASSED
statechart KeyboardExample PASSED
statechart LibTestNative PASSED
statechart LibTestNormal PASSED
statechart PerformanceExample PASSED
statechart PingPongExample PASSED
statechart StateCastTestBoth PASSED
statechart StateCastTestNative PASSED
statechart StateCastTestNormal PASSED
statechart StateCastTestRelaxed PASSED
statechart StateIterationTestBoth PASSED
statechart StateIterationTestNative PASSED
statechart StateIterationTestNormal PASSED
statechart StateIterationTestRelaxed PASSED
statechart StopWatch2Example PASSED
statechart StopWatchExample PASSED
statechart TerminationTestBoth PASSED
statechart TerminationTestNative PASSED
statechart TerminationTestNormal PASSED
statechart TerminationTestRelaxed PASSED
statechart TransitionTestBoth PASSED
statechart TransitionTestNative PASSED
statechart TransitionTestNormal PASSED
statechart TransitionTestRelaxed PASSED
statechart TriggeringEventTestBoth PASSED
statechart TriggeringEventTestNative PASSED
statechart TriggeringEventTestNormal PASSED
statechart TriggeringEventTestRelaxed PASSED
statechart TypeInfoTestBoth PASSED
statechart TypeInfoTestNative PASSED
statechart TypeInfoTestNormal PASSED
statechart TypeInfoTestRelaxed PASSED
statechart UnconsumedResultTestBoth PASSED
statechart UnconsumedResultTestNative PASSED
statechart UnconsumedResultTestNormal PASSED
statechart UnconsumedResultTestRelaxed PASSED
statechart UnsuppDeepHistoryTestBoth PASSED
statechart UnsuppDeepHistoryTestNative PASSED
statechart UnsuppDeepHistoryTestNormal PASSED
statechart UnsuppDeepHistoryTestRelaxed PASSED
statechart DllTestNormal FAILED
static_assert static_assert_example_2 PASSED
static_assert static_assert_example_3 PASSED
static_assert static_assert_test PASSED
static_assert static_assert_test_fail_1 PASSED
static_assert static_assert_test_fail_10 PASSED
static_assert static_assert_test_fail_2 PASSED
static_assert static_assert_test_fail_3 PASSED
static_assert static_assert_test_fail_4 PASSED
static_assert static_assert_test_fail_5 PASSED
static_assert static_assert_test_fail_6 PASSED
static_assert static_assert_test_fail_7 PASSED
static_assert static_assert_test_fail_8 PASSED
static_assert static_assert_test_fail_9 PASSED
system error_code_test PASSED
system error_code_test_shared PASSED
system error_code_user_test PASSED
system error_code_user_test_shared PASSED
system header_only_test PASSED
system initialization_test_shared PASSED
system system_error_test PASSED
system system_error_test_shared PASSED
system throw_test_shared PASSED
test algorithms_test PASSED
test basic_cstring_test PASSED
test boost_check_equal_str PASSED
test class_properties_test PASSED
test custom_exception_test PASSED
test fixed_mapping_test PASSED
test foreach_test PASSED
test ifstream_line_iterator_test PASSED
test minimal_test PASSED
test online_test PASSED
test output_test_stream_test PASSED
test parameterized_test_test PASSED
test prg_exec_fail1 PASSED
test prg_exec_fail3 PASSED
test prg_exec_fail4 PASSED
test result_report_test PASSED
test sync_access_test PASSED
test test_case_template_test PASSED
test test_fp_comparisons PASSED
test test_tree_management_test PASSED
test token_iterator_test PASSED
test errors_handling_test FAILED
test prg_exec_fail2 FAILED
test test_tools_test FAILED
thread async__async_p PASSED
thread async__async_p_lib PASSED
thread call_once_p PASSED
thread call_once_p_lib PASSED
thread condition_variable__assign_f PASSED
thread condition_variable__copy_f PASSED
thread condition_variable__default_p PASSED
thread condition_variable__default_p_lib PASSED
thread condition_variable__dtor_p PASSED
thread condition_variable__dtor_p_lib PASSED
thread condition_variable__native_handle_p PASSED
thread condition_variable__native_handle_p_lib PASSED
thread condition_variable__wait_for_p PASSED
thread condition_variable__wait_for_p_lib PASSED
thread condition_variable__wait_for_pred_p PASSED
thread condition_variable__wait_for_pred_p_lib PASSED
thread condition_variable__wait_p PASSED
thread condition_variable__wait_p_lib PASSED
thread condition_variable__wait_until_p PASSED
thread condition_variable__wait_until_p_lib PASSED
thread condition_variable__wait_until_pred_p PASSED
thread condition_variable__wait_until_pred_p_lib PASSED
thread condition_variable_any__assign_f PASSED
thread condition_variable_any__copy_f PASSED
thread condition_variable_any__default_p PASSED
thread condition_variable_any__default_p_lib PASSED
thread condition_variable_any__dtor_p PASSED
thread condition_variable_any__dtor_p_lib PASSED
thread condition_variable_any__wait_for_p PASSED
thread condition_variable_any__wait_for_p_lib PASSED
thread condition_variable_any__wait_for_pred_p PASSED
thread condition_variable_any__wait_for_pred_p_lib PASSED
thread condition_variable_any__wait_until_p PASSED
thread condition_variable_any__wait_until_p_lib PASSED
thread condition_variable_any__wait_until_pred_p PASSED
thread condition_variable_any__wait_until_pred_p_lib PASSED
thread container__thread_ptr_list_p PASSED
thread container__thread_ptr_list_p_lib PASSED
thread container__thread_vector_p PASSED
thread container__thread_vector_p_lib PASSED
thread cv_status__cv_status_p PASSED
thread cv_status__cv_status_p_lib PASSED
thread ex_ba_externallly_locked PASSED
thread ex_ba_externallly_locked_lib PASSED
thread ex_condition PASSED
thread ex_future_fallback_to PASSED
thread ex_future_fallback_to_lib PASSED
thread ex_future_then PASSED
thread ex_future_then_lib PASSED
thread ex_future_unwrap PASSED
thread ex_future_unwrap_lib PASSED
thread ex_lambda_future PASSED
thread ex_lambda_future_lib PASSED
thread ex_make_future PASSED
thread ex_make_future_lib PASSED
thread ex_monitor PASSED
thread ex_monitor_lib PASSED
thread ex_mutex PASSED
thread ex_mutex_lib PASSED
thread ex_not_interleaved PASSED
thread ex_not_interleaved_lib PASSED
thread ex_once PASSED
thread ex_once_lib PASSED
thread ex_recursive_mutex PASSED
thread ex_recursive_mutex_lib PASSED
thread ex_scoped_thread PASSED
thread ex_scoped_thread_lib PASSED
thread ex_shared_mutex PASSED
thread ex_shared_mutex_lib PASSED
thread ex_starvephil PASSED
thread ex_strict_lock PASSED
thread ex_strict_lock_lib PASSED
thread ex_synchronized_person PASSED
thread ex_synchronized_person_lib PASSED
thread ex_synchronized_value PASSED
thread ex_synchronized_value_lib PASSED
thread ex_tennis PASSED
thread ex_tennis_lib PASSED
thread ex_thread PASSED
thread ex_thread_group PASSED
thread ex_thread_group_lib PASSED
thread ex_thread_guard PASSED
thread ex_thread_guard_lib PASSED
thread ex_thread_lib PASSED
thread ex_tss PASSED
thread ex_tss_lib PASSED
thread ex_xtime PASSED
thread ex_xtime_lib PASSED
thread future__copy_assign_f PASSED
thread future__copy_ctor_f PASSED
thread future__default_p PASSED
thread future__default_p_lib PASSED
thread future__dtor_p PASSED
thread future__dtor_p_lib PASSED
thread future__get_or_p PASSED
thread future__get_or_p_lib PASSED
thread future__get_p PASSED
thread future__get_p_lib PASSED
thread future__move_asign_p PASSED
thread future__move_asign_p_lib PASSED
thread future__move_ctor_p PASSED
thread future__move_ctor_p_lib PASSED
thread future__share_p PASSED
thread future__share_p_lib PASSED
thread future__then_p PASSED
thread future__then_p_lib PASSED
thread future__wait_for_p PASSED
thread future__wait_for_p_lib PASSED
thread future__wait_p PASSED
thread future__wait_p_lib PASSED
thread future__wait_until_p PASSED
thread future__wait_until_p_lib PASSED
thread lock_guard__cons__adopt_lock_p PASSED
thread lock_guard__cons__adopt_lock_p_lib PASSED
thread lock_guard__cons__copy_assign_f PASSED
thread lock_guard__cons__copy_ctor_f PASSED
thread lock_guard__cons__default_p PASSED
thread lock_guard__cons__default_p_lib PASSED
thread lock_guard__types_p PASSED
thread lock_guard__types_p_lib PASSED
thread make_lock_guard__adopt_lock_p PASSED
thread make_lock_guard__adopt_lock_p_lib PASSED
thread make_lock_guard_p PASSED
thread make_lock_guard_p_lib PASSED
thread make_nested_strict_lock_p PASSED
thread make_nested_strict_lock_p_lib PASSED
thread make_strict_lock_p PASSED
thread make_strict_lock_p_lib PASSED
thread make_unique_lock__adopt_lock_p PASSED
thread make_unique_lock__adopt_lock_p_lib PASSED
thread make_unique_lock__defer_lock_p PASSED
thread make_unique_lock__defer_lock_p_lib PASSED
thread make_unique_lock__mutex_p PASSED
thread make_unique_lock__mutex_p_lib PASSED
thread make_unique_lock__try_to_lock_p PASSED
thread make_unique_lock__try_to_lock_p_lib PASSED
thread make_unique_locks__mutex_p PASSED
thread make_unique_locks__mutex_p_lib PASSED
thread mutex__assign_f PASSED
thread mutex__copy_f PASSED
thread mutex__default_p PASSED
thread mutex__default_p_lib PASSED
thread mutex__lock_p PASSED
thread mutex__lock_p_lib PASSED
thread mutex__native_handle_p PASSED
thread mutex__native_handle_p_lib PASSED
thread mutex__try_lock_p PASSED
thread mutex__try_lock_p_lib PASSED
thread nested_strict_lock__cons__copy_assign_f PASSED
thread nested_strict_lock__cons__copy_ctor_f PASSED
thread nested_strict_lock__cons__default_p PASSED
thread nested_strict_lock__cons__default_p_lib PASSED
thread nested_strict_lock__owns_lock_p PASSED
thread nested_strict_lock__owns_lock_p_lib PASSED
thread nested_strict_lock__types_p PASSED
thread nested_strict_lock__types_p_lib PASSED
thread no_implicit_assign_from_lvalue_thread PASSED
thread no_implicit_move_from_lvalue_thread PASSED
thread notify_all_at_thread_exit_p PASSED
thread notify_all_at_thread_exit_p_lib PASSED
thread null_mutex__assign_f PASSED
thread null_mutex__copy_f PASSED
thread null_mutex__default_p PASSED
thread null_mutex__default_p_lib PASSED
thread null_mutex__lock_p PASSED
thread null_mutex__lock_p_lib PASSED
thread null_mutex__try_lock_for_p PASSED
thread null_mutex__try_lock_for_p_lib PASSED
thread null_mutex__try_lock_p PASSED
thread null_mutex__try_lock_p_lib PASSED
thread null_mutex__try_lock_until_p PASSED
thread null_mutex__try_lock_until_p_lib PASSED
thread packaged_task__alloc_ctor_p PASSED
thread packaged_task__alloc_ctor_p_lib PASSED
thread packaged_task__copy_assign_f PASSED
thread packaged_task__copy_ctor_f PASSED
thread packaged_task__default_ctor_p PASSED
thread packaged_task__default_ctor_p_lib PASSED
thread packaged_task__dtor_p PASSED
thread packaged_task__dtor_p_lib PASSED
thread packaged_task__func_ctor_p PASSED
thread packaged_task__func_ctor_p_lib PASSED
thread packaged_task__get_future_p PASSED
thread packaged_task__get_future_p_lib PASSED
thread packaged_task__make_ready_at_thread_exit_p PASSED
thread packaged_task__make_ready_at_thread_exit_p_lib PASSED
thread packaged_task__member_swap_p PASSED
thread packaged_task__member_swap_p_lib PASSED
thread packaged_task__move_asign_p PASSED
thread packaged_task__move_asign_p_lib PASSED
thread packaged_task__move_ctor_p PASSED
thread packaged_task__move_ctor_p_lib PASSED
thread packaged_task__non_member_swap_p PASSED
thread packaged_task__non_member_swap_p_lib PASSED
thread packaged_task__operator_p PASSED
thread packaged_task__operator_p_lib PASSED
thread packaged_task__reset_p PASSED
thread packaged_task__reset_p_lib PASSED
thread packaged_task__types_p PASSED
thread packaged_task__types_p_lib PASSED
thread packaged_task__use_allocator_p PASSED
thread packaged_task__use_allocator_p_lib PASSED
thread promise__alloc_ctor_p PASSED
thread promise__alloc_ctor_p_lib PASSED
thread promise__copy_assign_f PASSED
thread promise__copy_ctor_f PASSED
thread promise__default_p PASSED
thread promise__default_p_lib PASSED
thread promise__dtor_p PASSED
thread promise__dtor_p_lib PASSED
thread promise__get_future_p PASSED
thread promise__get_future_p_lib PASSED
thread promise__move_asign_p PASSED
thread promise__move_asign_p_lib PASSED
thread promise__move_ctor_p PASSED
thread promise__move_ctor_p_lib PASSED
thread promise__set_exception_at_thread_exit_p PASSED
thread promise__set_exception_at_thread_exit_p_lib PASSED
thread promise__set_exception_p PASSED
thread promise__set_exception_p_lib PASSED
thread promise__set_lvalue_at_thread_exit_p PASSED
thread promise__set_lvalue_at_thread_exit_p_lib PASSED
thread promise__set_lvalue_p PASSED
thread promise__set_lvalue_p_lib PASSED
thread promise__set_rvalue_at_thread_exit_p PASSED
thread promise__set_rvalue_at_thread_exit_p_lib PASSED
thread promise__set_rvalue_p PASSED
thread promise__set_rvalue_p_lib PASSED
thread promise__set_value_at_thread_exit_const_p PASSED
thread promise__set_value_at_thread_exit_const_p_lib PASSED
thread promise__set_value_at_thread_exit_void_p PASSED
thread promise__set_value_at_thread_exit_void_p_lib PASSED
thread promise__set_value_const_p PASSED
thread promise__set_value_const_p_lib PASSED
thread promise__set_value_void_p PASSED
thread promise__set_value_void_p_lib PASSED
thread promise__use_allocator_p PASSED
thread promise__use_allocator_p_lib PASSED
thread recursive_mutex__assign_f PASSED
thread recursive_mutex__copy_f PASSED
thread recursive_mutex__default_p PASSED
thread recursive_mutex__default_p_lib PASSED
thread recursive_mutex__lock_p PASSED
thread recursive_mutex__lock_p_lib PASSED
thread recursive_mutex__native_handle_p PASSED
thread recursive_mutex__native_handle_p_lib PASSED
thread recursive_mutex__try_lock_p PASSED
thread recursive_mutex__try_lock_p_lib PASSED
thread recursive_timed_mutex__assign_f PASSED
thread recursive_timed_mutex__copy_f PASSED
thread recursive_timed_mutex__default_p PASSED
thread recursive_timed_mutex__default_p_lib PASSED
thread recursive_timed_mutex__lock_p PASSED
thread recursive_timed_mutex__lock_p_lib PASSED
thread recursive_timed_mutex__native_handle_p PASSED
thread recursive_timed_mutex__native_handle_p_lib PASSED
thread recursive_timed_mutex__try_lock_for_p PASSED
thread recursive_timed_mutex__try_lock_for_p_lib PASSED
thread recursive_timed_mutex__try_lock_p PASSED
thread recursive_timed_mutex__try_lock_p_lib PASSED
thread recursive_timed_mutex__try_lock_until_p PASSED
thread recursive_timed_mutex__try_lock_until_p_lib PASSED
thread reverse_lock__copy_assign_f PASSED
thread reverse_lock__copy_ctor_f PASSED
thread reverse_lock__types_p PASSED
thread reverse_lock__types_p_lib PASSED
thread reverse_lock__unique_lock_ctor_p PASSED
thread reverse_lock__unique_lock_ctor_p_lib PASSED
thread shared_future__copy_assign_p PASSED
thread shared_future__copy_assign_p_lib PASSED
thread shared_future__copy_ctor_p PASSED
thread shared_future__copy_ctor_p_lib PASSED
thread shared_future__default_p PASSED
thread shared_future__default_p_lib PASSED
thread shared_future__dtor_p PASSED
thread shared_future__dtor_p_lib PASSED
thread shared_future__get_p PASSED
thread shared_future__get_p_lib PASSED
thread shared_future__move_asign_p PASSED
thread shared_future__move_asign_p_lib PASSED
thread shared_future__move_ctor_p PASSED
thread shared_future__move_ctor_p_lib PASSED
thread shared_future__then_p PASSED
thread shared_future__then_p_lib PASSED
thread shared_future__wait_for_p PASSED
thread shared_future__wait_for_p_lib PASSED
thread shared_future__wait_p PASSED
thread shared_future__wait_p_lib PASSED
thread shared_future__wait_until_p PASSED
thread shared_future__wait_until_p_lib PASSED
thread shared_lock__cons__adopt_lock_p PASSED
thread shared_lock__cons__adopt_lock_p_lib PASSED
thread shared_lock__cons__copy_assign_f PASSED
thread shared_lock__cons__copy_ctor_f PASSED
thread shared_lock__cons__default_p PASSED
thread shared_lock__cons__default_p_lib PASSED
thread shared_lock__cons__defer_lock_p PASSED
thread shared_lock__cons__defer_lock_p_lib PASSED
thread shared_lock__cons__duration_p PASSED
thread shared_lock__cons__duration_p_lib PASSED
thread shared_lock__cons__move_assign_p PASSED
thread shared_lock__cons__move_assign_p_lib PASSED
thread shared_lock__cons__move_ctor_p PASSED
thread shared_lock__cons__move_ctor_p_lib PASSED
thread shared_lock__cons__move_ctor_unique_lock_p PASSED
thread shared_lock__cons__move_ctor_unique_lock_p_lib PASSED
thread shared_lock__cons__move_ctor_upgrade_lock_p PASSED
thread shared_lock__cons__move_ctor_upgrade_lock_p_lib PASSED
thread shared_lock__cons__mutex_p PASSED
thread shared_lock__cons__mutex_p_lib PASSED
thread shared_lock__cons__time_point_p PASSED
thread shared_lock__cons__time_point_p_lib PASSED
thread shared_lock__cons__try_to_lock_p PASSED
thread shared_lock__cons__try_to_lock_p_lib PASSED
thread shared_lock__lock_p PASSED
thread shared_lock__lock_p_lib PASSED
thread shared_lock__member_swap_p PASSED
thread shared_lock__member_swap_p_lib PASSED
thread shared_lock__mutex_p PASSED
thread shared_lock__mutex_p_lib PASSED
thread shared_lock__non_member_swap_p PASSED
thread shared_lock__non_member_swap_p_lib PASSED
thread shared_lock__op_bool_p PASSED
thread shared_lock__op_bool_p_lib PASSED
thread shared_lock__owns_lock_p PASSED
thread shared_lock__owns_lock_p_lib PASSED
thread shared_lock__release_p PASSED
thread shared_lock__release_p_lib PASSED
thread shared_lock__try_lock_for_p PASSED
thread shared_lock__try_lock_for_p_lib PASSED
thread shared_lock__try_lock_p PASSED
thread shared_lock__try_lock_p_lib PASSED
thread shared_lock__try_lock_until_p PASSED
thread shared_lock__try_lock_until_p_lib PASSED
thread shared_lock__types_p PASSED
thread shared_lock__types_p_lib PASSED
thread shared_lock__unlock_p PASSED
thread shared_lock__unlock_p_lib PASSED
thread shared_lock_guard__cons__adopt_lock_p PASSED
thread shared_lock_guard__cons__adopt_lock_p_lib PASSED
thread shared_lock_guard__cons__copy_assign_f PASSED
thread shared_lock_guard__cons__copy_ctor_f PASSED
thread shared_lock_guard__cons__default_p PASSED
thread shared_lock_guard__cons__default_p_lib PASSED
thread shared_lock_guard__types_p PASSED
thread shared_lock_guard__types_p_lib PASSED
thread shared_mutex__assign_f PASSED
thread shared_mutex__copy_f PASSED
thread shared_mutex__default_p PASSED
thread shared_mutex__default_p_lib PASSED
thread shared_mutex__lock_p PASSED
thread shared_mutex__lock_p_lib PASSED
thread shared_mutex__try_lock_for_p PASSED
thread shared_mutex__try_lock_for_p_lib PASSED
thread shared_mutex__try_lock_p PASSED
thread shared_mutex__try_lock_p_lib PASSED
thread shared_mutex__try_lock_until_p PASSED
thread shared_mutex__try_lock_until_p_lib PASSED
thread strict_lock__cons__copy_assign_f PASSED
thread strict_lock__cons__copy_ctor_f PASSED
thread strict_lock__cons__default_p PASSED
thread strict_lock__cons__default_p_lib PASSED
thread strict_lock__owns_lock_p PASSED
thread strict_lock__owns_lock_p_lib PASSED
thread strict_lock__types_p PASSED
thread strict_lock__types_p_lib PASSED
thread swap_threads_p PASSED
thread swap_threads_p_lib PASSED
thread sync_bounded_queue__multi_thread_p PASSED
thread sync_bounded_queue__multi_thread_p_lib PASSED
thread sync_bounded_queue__single_thread_p PASSED
thread sync_bounded_queue__single_thread_p_lib PASSED
thread sync_queue__multi_thread_p PASSED
thread sync_queue__multi_thread_p_lib PASSED
thread sync_queue__single_thread_p PASSED
thread sync_queue__single_thread_p_lib PASSED
thread synchronized_value__call_p PASSED
thread synchronized_value__call_p_lib PASSED
thread synchronized_value__copy_T_assign_p PASSED
thread synchronized_value__copy_T_assign_p_lib PASSED
thread synchronized_value__copy_T_ctor_p PASSED
thread synchronized_value__copy_T_ctor_p_lib PASSED
thread synchronized_value__copy_assign_p PASSED
thread synchronized_value__copy_assign_p_lib PASSED
thread synchronized_value__copy_ctor_p PASSED
thread synchronized_value__copy_ctor_p_lib PASSED
thread synchronized_value__default_ctor_p_lib PASSED
thread synchronized_value__indirect_p PASSED
thread synchronized_value__indirect_p_lib PASSED
thread synchronized_value__move_T_assign_p PASSED
thread synchronized_value__move_T_assign_p_lib PASSED
thread synchronized_value__move_T_ctor_p PASSED
thread synchronized_value__move_T_ctor_p_lib PASSED
thread synchronized_value__move_assign_p PASSED
thread synchronized_value__move_assign_p_lib PASSED
thread synchronized_value__move_ctor_p PASSED
thread synchronized_value__move_ctor_p_lib PASSED
thread synchronized_value__swap_T_p PASSED
thread synchronized_value__swap_T_p_lib PASSED
thread synchronized_value__swap_p PASSED
thread synchronized_value__swap_p_lib PASSED
thread synchronized_value__synchronize_p PASSED
thread synchronized_value__synchronize_p_lib PASSED
thread test_2309 PASSED
thread test_2309_lib PASSED
thread test_2501 PASSED
thread test_2501_lib PASSED
thread test_2741 PASSED
thread test_2741_lib PASSED
thread test_3628 PASSED
thread test_3628_lib PASSED
thread test_4521 PASSED
thread test_4521_lib PASSED
thread test_4648 PASSED
thread test_4648_lib PASSED
thread test_4882 PASSED
thread test_4882_lib PASSED
thread test_5542_1 PASSED
thread test_5542_1_lib PASSED
thread test_5542_2 PASSED
thread test_5542_2_lib PASSED
thread test_5542_3 PASSED
thread test_5542_3_lib PASSED
thread test_5891 PASSED
thread test_5891_lib PASSED
thread test_6174 PASSED
thread test_6174_lib PASSED
thread test_7328 PASSED
thread test_7328_lib PASSED
thread test_7571 PASSED
thread test_7571_lib PASSED
thread test_barrier PASSED
thread test_barrier_lib PASSED
thread test_barrier_size_fct PASSED
thread test_barrier_size_fct_lib PASSED
thread test_barrier_void_fct PASSED
thread test_barrier_void_fct_lib PASSED
thread test_completion_latch PASSED
thread test_completion_latch_lib PASSED
thread test_condition PASSED
thread test_condition_lib PASSED
thread test_condition_notify_all PASSED
thread test_condition_notify_all_lib PASSED
thread test_condition_notify_one PASSED
thread test_condition_notify_one_lib PASSED
thread test_condition_timed_wait_times_out PASSED
thread test_condition_timed_wait_times_out_lib PASSED
thread test_futures PASSED
thread test_futures_lib PASSED
thread test_generic_locks PASSED
thread test_generic_locks_lib PASSED
thread test_hardware_concurrency PASSED
thread test_hardware_concurrency_lib PASSED
thread test_latch PASSED
thread test_latch_lib PASSED
thread test_lock_concept PASSED
thread test_lock_concept_lib PASSED
thread test_move_function PASSED
thread test_move_function_lib PASSED
thread test_mutex PASSED
thread test_mutex_lib PASSED
thread test_once PASSED
thread test_once_lib PASSED
thread test_shared_mutex PASSED
thread test_shared_mutex_lib PASSED
thread test_shared_mutex_part_2 PASSED
thread test_shared_mutex_part_2_lib PASSED
thread test_shared_mutex_timed_locks PASSED
thread test_shared_mutex_timed_locks_chrono PASSED
thread test_shared_mutex_timed_locks_chrono_lib PASSED
thread test_shared_mutex_timed_locks_lib PASSED
thread test_thread PASSED
thread test_thread_exit PASSED
thread test_thread_exit_lib PASSED
thread test_thread_id PASSED
thread test_thread_id_lib PASSED
thread test_thread_launching PASSED
thread test_thread_launching_lib PASSED
thread test_thread_lib PASSED
thread test_thread_mf PASSED
thread test_thread_mf_lib PASSED
thread test_thread_move PASSED
thread test_thread_move_lib PASSED
thread test_thread_move_return PASSED
thread test_thread_move_return_lib PASSED
thread test_thread_return_local PASSED
thread test_thread_return_local_lib PASSED
thread test_tss PASSED
thread test_tss_lib PASSED
thread test_xtime PASSED
thread test_xtime_lib PASSED
thread this_thread__get_id_p PASSED
thread this_thread__get_id_p_lib PASSED
thread this_thread__sleep_for_p PASSED
thread this_thread__sleep_for_p_lib PASSED
thread this_thread__sleep_until_p PASSED
thread this_thread__sleep_until_p_lib PASSED
thread thread__assign__copy_f PASSED
thread thread__assign__move_p PASSED
thread thread__assign__move_p_lib PASSED
thread thread__constr__FrvalueArgs_p PASSED
thread thread__constr__FrvalueArgs_p_lib PASSED
thread thread__constr__Frvalue_p PASSED
thread thread__constr__Frvalue_p_lib PASSED
thread thread__constr__copy_f PASSED
thread thread__constr__default_p PASSED
thread thread__constr__default_p_lib PASSED
thread thread__constr__lambda_p_lib PASSED
thread thread__constr__move_p PASSED
thread thread__constr__move_p_lib PASSED
thread thread__destr__dtor_p PASSED
thread thread__destr__dtor_p_lib PASSED
thread thread__detach_p PASSED
thread thread__detach_p_lib PASSED
thread thread__get_id_p PASSED
thread thread__get_id_p_lib PASSED
thread thread__hardware_concurrency_p PASSED
thread thread__hardware_concurrency_p_lib PASSED
thread thread__id__hash_p PASSED
thread thread__id__hash_p_lib PASSED
thread thread__join_for_p PASSED
thread thread__join_for_p_lib PASSED
thread thread__join_p PASSED
thread thread__join_p_lib PASSED
thread thread__join_until_p PASSED
thread thread__join_until_p_lib PASSED
thread thread__joinable_p PASSED
thread thread__joinable_p_lib PASSED
thread thread__native_handle_p PASSED
thread thread__native_handle_p_lib PASSED
thread thread__swap_p PASSED
thread thread__swap_p_lib PASSED
thread timed_mutex__assign_f PASSED
thread timed_mutex__copy_f PASSED
thread timed_mutex__default_p PASSED
thread timed_mutex__default_p_lib PASSED
thread timed_mutex__lock_p PASSED
thread timed_mutex__lock_p_lib PASSED
thread timed_mutex__native_handle_p PASSED
thread timed_mutex__native_handle_p_lib PASSED
thread timed_mutex__try_lock_for_p PASSED
thread timed_mutex__try_lock_for_p_lib PASSED
thread timed_mutex__try_lock_p PASSED
thread timed_mutex__try_lock_p_lib PASSED
thread timed_mutex__try_lock_until_p PASSED
thread timed_mutex__try_lock_until_p_lib PASSED
thread unique_lock__cons__adopt_lock_p PASSED
thread unique_lock__cons__adopt_lock_p_lib PASSED
thread unique_lock__cons__copy_assign_f PASSED
thread unique_lock__cons__copy_ctor_f PASSED
thread unique_lock__cons__default_p PASSED
thread unique_lock__cons__default_p_lib PASSED
thread unique_lock__cons__defer_lock_p PASSED
thread unique_lock__cons__defer_lock_p_lib PASSED
thread unique_lock__cons__duration_p PASSED
thread unique_lock__cons__duration_p_lib PASSED
thread unique_lock__cons__move_assign_p PASSED
thread unique_lock__cons__move_assign_p_lib PASSED
thread unique_lock__cons__move_ctor_p PASSED
thread unique_lock__cons__move_ctor_p_lib PASSED
thread unique_lock__cons__move_ctor_shared_lock_for_p PASSED
thread unique_lock__cons__move_ctor_shared_lock_for_p_lib PASSED
thread unique_lock__cons__move_ctor_shared_lock_try_p PASSED
thread unique_lock__cons__move_ctor_shared_lock_try_p_lib PASSED
thread unique_lock__cons__move_ctor_shared_lock_until_p PASSED
thread unique_lock__cons__move_ctor_shared_lock_until_p_lib PASSED
thread unique_lock__cons__move_ctor_upgrade_lock_for_p PASSED
thread unique_lock__cons__move_ctor_upgrade_lock_for_p_lib PASSED
thread unique_lock__cons__move_ctor_upgrade_lock_p PASSED
thread unique_lock__cons__move_ctor_upgrade_lock_p_lib PASSED
thread unique_lock__cons__move_ctor_upgrade_lock_try_p PASSED
thread unique_lock__cons__move_ctor_upgrade_lock_try_p_lib PASSED
thread unique_lock__cons__move_ctor_upgrade_lock_until_p PASSED
thread unique_lock__cons__move_ctor_upgrade_lock_until_p_lib PASSED
thread unique_lock__cons__mutex_p PASSED
thread unique_lock__cons__mutex_p_lib PASSED
thread unique_lock__cons__time_point_p PASSED
thread unique_lock__cons__time_point_p_lib PASSED
thread unique_lock__cons__try_to_lock_p PASSED
thread unique_lock__cons__try_to_lock_p_lib PASSED
thread unique_lock__lock_p PASSED
thread unique_lock__lock_p_lib PASSED
thread unique_lock__member_swap_p PASSED
thread unique_lock__member_swap_p_lib PASSED
thread unique_lock__mutex_p PASSED
thread unique_lock__mutex_p_lib PASSED
thread unique_lock__non_member_swap_p PASSED
thread unique_lock__non_member_swap_p_lib PASSED
thread unique_lock__op_bool_p PASSED
thread unique_lock__op_bool_p_lib PASSED
thread unique_lock__owns_lock_p PASSED
thread unique_lock__owns_lock_p_lib PASSED
thread unique_lock__release_p PASSED
thread unique_lock__release_p_lib PASSED
thread unique_lock__try_lock_for_p PASSED
thread unique_lock__try_lock_for_p_lib PASSED
thread unique_lock__try_lock_p PASSED
thread unique_lock__try_lock_p_lib PASSED
thread unique_lock__try_lock_until_p PASSED
thread unique_lock__try_lock_until_p_lib PASSED
thread unique_lock__types_p PASSED
thread unique_lock__types_p_lib PASSED
thread unique_lock__unlock_p PASSED
thread unique_lock__unlock_p_lib PASSED
thread upgrade_lock__cons__adopt_lock_p PASSED
thread upgrade_lock__cons__adopt_lock_p_lib PASSED
thread upgrade_lock__cons__copy_assign_f PASSED
thread upgrade_lock__cons__copy_ctor_f PASSED
thread upgrade_lock__cons__default_p PASSED
thread upgrade_lock__cons__default_p_lib PASSED
thread upgrade_lock__cons__defer_lock_p PASSED
thread upgrade_lock__cons__defer_lock_p_lib PASSED
thread upgrade_lock__cons__duration_p PASSED
thread upgrade_lock__cons__duration_p_lib PASSED
thread upgrade_lock__cons__move_assign_p PASSED
thread upgrade_lock__cons__move_assign_p_lib PASSED
thread upgrade_lock__cons__move_ctor_p PASSED
thread upgrade_lock__cons__move_ctor_p_lib PASSED
thread upgrade_lock__cons__move_ctor_shared_lock_for_p PASSED
thread upgrade_lock__cons__move_ctor_shared_lock_for_p_lib PASSED
thread upgrade_lock__cons__move_ctor_shared_lock_try_p PASSED
thread upgrade_lock__cons__move_ctor_shared_lock_try_p_lib PASSED
thread upgrade_lock__cons__move_ctor_shared_lock_until_p PASSED
thread upgrade_lock__cons__move_ctor_shared_lock_until_p_lib PASSED
thread upgrade_lock__cons__move_ctor_unique_lock_p PASSED
thread upgrade_lock__cons__move_ctor_unique_lock_p_lib PASSED
thread upgrade_lock__cons__mutex_p PASSED
thread upgrade_lock__cons__mutex_p_lib PASSED
thread upgrade_lock__cons__time_point_p PASSED
thread upgrade_lock__cons__time_point_p_lib PASSED
thread upgrade_lock__cons__try_to_lock_p PASSED
thread upgrade_lock__cons__try_to_lock_p_lib PASSED
thread upgrade_lock__lock_p PASSED
thread upgrade_lock__lock_p_lib PASSED
thread upgrade_lock__member_swap_p PASSED
thread upgrade_lock__member_swap_p_lib PASSED
thread upgrade_lock__mutex_p PASSED
thread upgrade_lock__mutex_p_lib PASSED
thread upgrade_lock__non_member_swap_p PASSED
thread upgrade_lock__non_member_swap_p_lib PASSED
thread upgrade_lock__op_bool_p PASSED
thread upgrade_lock__op_bool_p_lib PASSED
thread upgrade_lock__owns_lock_p PASSED
thread upgrade_lock__owns_lock_p_lib PASSED
thread upgrade_lock__release_p PASSED
thread upgrade_lock__release_p_lib PASSED
thread upgrade_lock__try_lock_for_p PASSED
thread upgrade_lock__try_lock_for_p_lib PASSED
thread upgrade_lock__try_lock_p PASSED
thread upgrade_lock__try_lock_p_lib PASSED
thread upgrade_lock__try_lock_until_p PASSED
thread upgrade_lock__try_lock_until_p_lib PASSED
thread upgrade_lock__types_p PASSED
thread upgrade_lock__types_p_lib PASSED
thread upgrade_lock__unlock_p PASSED
thread upgrade_lock__unlock_p_lib PASSED
thread ex_producer_consumer FAILED
thread ex_producer_consumer_bounded FAILED
thread ex_producer_consumer_bounded_lib FAILED
thread ex_producer_consumer_lib FAILED
thread ex_shared_monitor FAILED
thread ex_shared_monitor_lib FAILED
thread synchronized_value__default_ctor_p FAILED
thread thread__constr__FArgs_p_lib FAILED
thread thread__constr__F_p_lib FAILED
timer auto_cpu_timer_example PASSED
timer cpu_timer_info PASSED
timer cpu_timer_test PASSED
timer original_timer_test PASSED
timer timex PASSED
tokenizer examples PASSED
tokenizer simple_example_1 PASSED
tokenizer simple_example_2 PASSED
tokenizer simple_example_3 PASSED
tokenizer simple_example_4 PASSED
tokenizer simple_example_5 PASSED
tr1 config PASSED
tr1 function PASSED
tr1 function0 PASSED
tr1 function1 PASSED
tr1 function2 PASSED
tr1 function3 PASSED
tr1 function4 PASSED
tr1 function5 PASSED
tr1 function6 PASSED
tr1 function7 PASSED
tr1 function8 PASSED
tr1 function9 PASSED
tr1 hash PASSED
tr1 intrusive_ptr PASSED
tr1 make_tuple PASSED
tr1 math_special_functions PASSED
tr1 math_tr1 PASSED
tr1 program_options PASSED
tr1 regex PASSED
tr1 run_complex_overloads PASSED
tr1 shared_count PASSED
tr1 shared_ptr PASSED
tr1 std_run_complex_overloads PASSED
tr1 std_test_array PASSED
tr1 std_test_array_tricky PASSED
tr1 std_test_bind_header PASSED
tr1 std_test_complex_header PASSED
tr1 std_test_function PASSED
tr1 std_test_function_header PASSED
tr1 std_test_function_tricky PASSED
tr1 std_test_hash PASSED
tr1 std_test_hash_header PASSED
tr1 std_test_integral_const_header PASSED
tr1 std_test_mem_fn_header PASSED
tr1 std_test_mpl_header PASSED
tr1 std_test_random PASSED
tr1 std_test_ref_header PASSED
tr1 std_test_reference_wrapper PASSED
tr1 std_test_result_of PASSED
tr1 std_test_result_of_header PASSED
tr1 std_test_shared_array_header PASSED
tr1 std_test_tuple PASSED
tr1 std_test_tuple_tricky PASSED
tr1 std_test_type_traits_header PASSED
tr1 std_test_unordered_map PASSED
tr1 std_test_unordered_set PASSED
tr1 test_algorithm_std_header PASSED
tr1 test_array PASSED
tr1 test_array_tricky PASSED
tr1 test_bind PASSED
tr1 test_bind_header PASSED
tr1 test_bind_tricky PASSED
tr1 test_bitset_std_header PASSED
tr1 test_cmath PASSED
tr1 test_cmath_std_header PASSED
tr1 test_complex PASSED
tr1 test_complex_header PASSED
tr1 test_complex_std_header PASSED
tr1 test_deque_std_header PASSED
tr1 test_exception_std_header PASSED
tr1 test_fstream_std_header PASSED
tr1 test_function PASSED
tr1 test_function_header PASSED
tr1 test_function_tricky PASSED
tr1 test_functional_std_header PASSED
tr1 test_hash PASSED
tr1 test_hash_header PASSED
tr1 test_integral_const_header PASSED
tr1 test_iomanip_std_header PASSED
tr1 test_ios_std_header PASSED
tr1 test_iostream_std_header PASSED
tr1 test_istream_std_header PASSED
tr1 test_iterator_std_header PASSED
tr1 test_limits_std_header PASSED
tr1 test_list_std_header PASSED
tr1 test_locale_std_header PASSED
tr1 test_map_std_header PASSED
tr1 test_mem_fn PASSED
tr1 test_mem_fn_header PASSED
tr1 test_mpl_header PASSED
tr1 test_new_std_header PASSED
tr1 test_numeric_std_header PASSED
tr1 test_ostream_std_header PASSED
tr1 test_queue_std_header PASSED
tr1 test_random PASSED
tr1 test_ref_header PASSED
tr1 test_reference_wrapper PASSED
tr1 test_result_of PASSED
tr1 test_result_of_header PASSED
tr1 test_set_std_header PASSED
tr1 test_shared_array_header PASSED
tr1 test_shared_from_this_header PASSED
tr1 test_shared_ptr PASSED
tr1 test_shd_this_header PASSED
tr1 test_sstream_std_header PASSED
tr1 test_stack_std_header PASSED
tr1 test_stdexcept_std_header PASSED
tr1 test_streambuf_std_header PASSED
tr1 test_string_std_header PASSED
tr1 test_strstream_std_header PASSED
tr1 test_tr1_include PASSED
tr1 test_tuple PASSED
tr1 test_tuple_tricky PASSED
tr1 test_type_traits PASSED
tr1 test_type_traits_header PASSED
tr1 test_typeinfo_std_header PASSED
tr1 test_unordered_map PASSED
tr1 test_unordered_set PASSED
tr1 test_utility_std_header PASSED
tr1 test_valarray_std_header PASSED
tr1 test_vector_std_header PASSED
tr1 test_weak_ptr_header PASSED
tr1 tr1_add_const_test PASSED
tr1 tr1_add_cv_test PASSED
tr1 tr1_add_pointer_test PASSED
tr1 tr1_add_reference_test PASSED
tr1 tr1_add_volatile_test PASSED
tr1 tr1_aligned_storage_test PASSED
tr1 tr1_alignment_of_test PASSED
tr1 tr1_extent_test PASSED
tr1 tr1_has_tr1_array_fail PASSED
tr1 tr1_has_tr1_array_pass PASSED
tr1 tr1_has_tr1_bind_fail PASSED
tr1 tr1_has_tr1_bind_pass PASSED
tr1 tr1_has_tr1_cx_over_fail PASSED
tr1 tr1_has_tr1_cx_over_pass PASSED
tr1 tr1_has_tr1_cx_trig_fail PASSED
tr1 tr1_has_tr1_cx_trig_pass PASSED
tr1 tr1_has_tr1_function_fail PASSED
tr1 tr1_has_tr1_function_pass PASSED
tr1 tr1_has_tr1_hash_fail PASSED
tr1 tr1_has_tr1_hash_pass PASSED
tr1 tr1_has_tr1_mem_fn_fail PASSED
tr1 tr1_has_tr1_mem_fn_pass PASSED
tr1 tr1_has_tr1_random_fail PASSED
tr1 tr1_has_tr1_random_pass PASSED
tr1 tr1_has_tr1_ref_wrap_fail PASSED
tr1 tr1_has_tr1_ref_wrap_pass PASSED
tr1 tr1_has_tr1_regex_fail PASSED
tr1 tr1_has_tr1_regex_pass PASSED
tr1 tr1_has_tr1_result_of_fail PASSED
tr1 tr1_has_tr1_result_of_pass PASSED
tr1 tr1_has_tr1_shared_ptr_fail PASSED
tr1 tr1_has_tr1_shared_ptr_pass PASSED
tr1 tr1_has_tr1_tt_fail PASSED
tr1 tr1_has_tr1_tt_pass PASSED
tr1 tr1_has_tr1_tuple_fail PASSED
tr1 tr1_has_tr1_tuple_pass PASSED
tr1 tr1_has_tr1_un_map_fail PASSED
tr1 tr1_has_tr1_un_map_pass PASSED
tr1 tr1_has_tr1_un_set_fail PASSED
tr1 tr1_has_tr1_un_set_pass PASSED
tr1 tr1_has_tr1_utility_fail PASSED
tr1 tr1_has_tr1_utility_pass PASSED
tr1 tr1_is_abstract_test PASSED
tr1 tr1_is_arithmetic_test PASSED
tr1 tr1_is_array_test PASSED
tr1 tr1_is_base_of_test PASSED
tr1 tr1_is_compound_test PASSED
tr1 tr1_is_const_test PASSED
tr1 tr1_is_convertible_test PASSED
tr1 tr1_is_empty_test PASSED
tr1 tr1_is_enum_test PASSED
tr1 tr1_is_floating_point_test PASSED
tr1 tr1_is_function_test PASSED
tr1 tr1_is_fundamental_test PASSED
tr1 tr1_is_integral_test PASSED
tr1 tr1_is_member_func_test PASSED
tr1 tr1_is_member_obj_test PASSED
tr1 tr1_is_member_pointer_test PASSED
tr1 tr1_is_object_test PASSED
tr1 tr1_is_pointer_test PASSED
tr1 tr1_is_polymorphic_test PASSED
tr1 tr1_is_reference_test PASSED
tr1 tr1_is_same_test PASSED
tr1 tr1_is_scalar_test PASSED
tr1 tr1_is_signed_test PASSED
tr1 tr1_is_unsigned_test PASSED
tr1 tr1_is_void_test PASSED
tr1 tr1_is_volatile_test PASSED
tr1 tr1_rank_test PASSED
tr1 tr1_remove_all_extents_test PASSED
tr1 tr1_remove_const_test PASSED
tr1 tr1_remove_cv_test PASSED
tr1 tr1_remove_extent_test PASSED
tr1 tr1_remove_pointer_test PASSED
tr1 tr1_remove_reference_test PASSED
tr1 tr1_remove_volatile_test PASSED
tr1 tr1_tky_abstract_type_test PASSED
tr1 tr1_tky_function_type_test PASSED
tr1 tr1_tky_incomp_type_test PASSED
tr1 tr1_tky_partial_spec_test PASSED
tr1 tr1_tricky_add_pointer_test PASSED
tr1 tr1_tricky_is_enum_test PASSED
tr1 tuple PASSED
tr1 tuple_fwd PASSED
tr1 tuple_tie PASSED
tr1 unordered_map PASSED
tr1 unordered_set PASSED
tr1 run_random FAILED
tr1 std_run_random FAILED
tr1 std_test_bind FAILED
tr1 std_test_bind_tricky FAILED
tr1 std_test_cmath FAILED
tr1 std_test_cmath_tricky FAILED
tr1 std_test_complex FAILED
tr1 std_test_mem_fn FAILED
tr1 std_test_mem_fn_tricky FAILED
tr1 std_test_ref_wrapper_tricky FAILED
tr1 std_test_regex FAILED
tr1 std_test_shared_from_this_header FAILED
tr1 std_test_shared_ptr FAILED
tr1 std_test_shd_this_header FAILED
tr1 std_test_tr1_include FAILED
tr1 std_test_type_traits FAILED
tr1 std_test_weak_ptr_header FAILED
tr1 test_cmath_tricky FAILED
tr1 test_mem_fn_tricky FAILED
tr1 test_memory_std_header FAILED
tr1 test_ref_wrapper_tricky FAILED
tr1 test_regex FAILED
tr1 tr1_has_nothrow_assign_test FAILED
tr1 tr1_has_nothrow_constr_test FAILED
tr1 tr1_has_nothrow_copy_test FAILED
tr1 tr1_has_trivial_assign_test FAILED
tr1 tr1_has_trivial_constr_test FAILED
tr1 tr1_has_trivial_copy_test FAILED
tr1 tr1_has_trivial_destr_test FAILED
tr1 tr1_has_virtual_destr_test FAILED
tr1 tr1_is_class_test FAILED
tr1 tr1_is_pod_test FAILED
tr1 tr1_is_union_test FAILED
tti test_has_data PASSED
tti test_has_data_compile PASSED
tti test_has_data_fail PASSED
tti test_has_data_fail2 PASSED
tti test_has_data_fail3 PASSED
tti test_has_data_fail4 PASSED
tti test_has_data_fail5 PASSED
tti test_has_data_fail6 PASSED
tti test_has_fun PASSED
tti test_has_fun_compile PASSED
tti test_has_fun_fail PASSED
tti test_has_fun_fail2 PASSED
tti test_has_fun_fail3 PASSED
tti test_has_fun_fail4 PASSED
tti test_has_fun_fail5 PASSED
tti test_has_mem_data PASSED
tti test_has_mem_data2 PASSED
tti test_has_mem_data_compile PASSED
tti test_has_mem_data_fail PASSED
tti test_has_mem_data_fail2 PASSED
tti test_has_mem_data_fail3 PASSED
tti test_has_mem_fun PASSED
tti test_has_mem_fun_compile PASSED
tti test_has_mem_fun_cv PASSED
tti test_has_mem_fun_cv_compile PASSED
tti test_has_mem_fun_cv_fail PASSED
tti test_has_mem_fun_cv_fail2 PASSED
tti test_has_mem_fun_cv_fail3 PASSED
tti test_has_mem_fun_cv_fail4 PASSED
tti test_has_mem_fun_cv_fail5 PASSED
tti test_has_mem_fun_cv_fail6 PASSED
tti test_has_mem_fun_fail PASSED
tti test_has_mem_fun_fail2 PASSED
tti test_has_mem_fun_fail3 PASSED
tti test_has_member PASSED
tti test_has_member_compile PASSED
tti test_has_member_cv PASSED
tti test_has_member_cv_compile PASSED
tti test_has_member_cv_fail PASSED
tti test_has_member_cv_fail2 PASSED
tti test_has_member_cv_fail3 PASSED
tti test_has_member_cv_fail4 PASSED
tti test_has_member_cv_fail5 PASSED
tti test_has_member_fail PASSED
tti test_has_member_fail2 PASSED
tti test_has_member_fail3 PASSED
tti test_has_static_mem_data PASSED
tti test_has_static_mem_data_compile PASSED
tti test_has_static_mem_data_fail PASSED
tti test_has_static_mem_data_fail2 PASSED
tti test_has_static_mem_data_fail3 PASSED
tti test_has_static_mem_fun PASSED
tti test_has_static_mem_fun_compile PASSED
tti test_has_static_mem_fun_fail PASSED
tti test_has_static_mem_fun_fail2 PASSED
tti test_has_static_member PASSED
tti test_has_static_member_compile PASSED
tti test_has_static_member_fail PASSED
tti test_has_static_member_fail2 PASSED
tti test_has_template PASSED
tti test_has_template_compile PASSED
tti test_has_template_compile_v PASSED
tti test_has_template_cp PASSED
tti test_has_template_cp_compile PASSED
tti test_has_template_cp_compile_v PASSED
tti test_has_template_cp_fail PASSED
tti test_has_template_cp_fail2 PASSED
tti test_has_template_cp_fail2_v PASSED
tti test_has_template_cp_fail3 PASSED
tti test_has_template_cp_fail3_v PASSED
tti test_has_template_cp_fail4 PASSED
tti test_has_template_cp_fail4_v PASSED
tti test_has_template_cp_fail_v PASSED
tti test_has_template_cp_v PASSED
tti test_has_template_fail PASSED
tti test_has_template_fail2 PASSED
tti test_has_template_fail2_v PASSED
tti test_has_template_fail3 PASSED
tti test_has_template_fail3_v PASSED
tti test_has_template_fail4 PASSED
tti test_has_template_fail4_v PASSED
tti test_has_template_fail_v PASSED
tti test_has_template_v PASSED
tti test_has_type PASSED
tti test_has_type_compile PASSED
tti test_has_type_ct PASSED
tti test_has_type_ct_compile PASSED
tti test_has_type_ct_fail PASSED
tti test_has_type_ct_fail2 PASSED
tti test_has_type_ct_fail3 PASSED
tti test_has_type_ct_fail4 PASSED
tti test_has_type_ct_fail5 PASSED
tti test_has_type_fail PASSED
tti test_has_type_fail2 PASSED
tti test_has_type_fail3 PASSED
tti test_mem_type PASSED
tti test_mem_type_compile PASSED
tti test_vm_has_template_cp PASSED
tti test_vm_has_template_cp_compile PASSED
tti test_vm_has_template_cp_fail PASSED
tti test_vm_has_template_cp_fail2 PASSED
tti test_vm_has_template_cp_fail3 PASSED
tti test_vm_has_template_cp_fail4 PASSED
tuple another_tuple_test_bench PASSED
tuple io_test PASSED
tuple tuple_test_bench PASSED
type_erasure fail_any_cast_discard_const1 PASSED
type_erasure fail_any_cast_discard_const2 PASSED
type_erasure fail_any_cast_discard_const3 PASSED
type_erasure fail_any_cast_discard_const4 PASSED
type_erasure fail_any_cast_discard_const5 PASSED
type_erasure fail_any_cast_discard_const6 PASSED
type_erasure fail_any_cast_pointer_to_ref PASSED
type_erasure fail_any_cast_pointer_to_val PASSED
type_erasure fail_binding_convert_no_mapping PASSED
type_erasure fail_construct_mismatch PASSED
type_erasure fail_construct_mismatch_cref PASSED
type_erasure fail_construct_mismatch_ref PASSED
type_erasure fail_cref_assign PASSED
type_erasure fail_default_construct PASSED
type_erasure fail_increment_discard_const PASSED
type_erasure fail_ref_assign PASSED
type_erasure fail_ref_discard_const PASSED
type_erasure fail_ref_discard_const_convert PASSED
type_erasure fail_ref_discard_const_convert_cref PASSED
type_erasure fail_ref_discard_const_convert_ref PASSED
type_erasure fail_ref_discard_const_init PASSED
type_erasure test_add PASSED
type_erasure test_add_assign PASSED
type_erasure test_any_cast PASSED
type_erasure test_assign PASSED
type_erasure test_binding PASSED
type_erasure test_binding_of PASSED
type_erasure test_callable PASSED
type_erasure test_construct_cref PASSED
type_erasure test_construct_ref PASSED
type_erasure test_deduced PASSED
type_erasure test_dereference PASSED
type_erasure test_equal PASSED
type_erasure test_forward_iterator PASSED
type_erasure test_free PASSED
type_erasure test_increment PASSED
type_erasure test_is_empty PASSED
type_erasure test_is_subconcept PASSED
type_erasure test_less PASSED
type_erasure test_member PASSED
type_erasure test_negate PASSED
type_erasure test_nested PASSED
type_erasure test_null PASSED
type_erasure test_param PASSED
type_erasure test_reference PASSED
type_erasure test_relaxed PASSED
type_erasure test_same_type PASSED
type_erasure test_stream PASSED
type_erasure test_subscript PASSED
type_erasure test_tuple PASSED
type_erasure test_typeid_of PASSED
type_erasure test_construct FAILED
type_traits add_const_test PASSED
type_traits add_cv_test PASSED
type_traits add_lvalue_reference_test PASSED
type_traits add_pointer_test PASSED
type_traits add_reference_test PASSED
type_traits add_rvalue_reference_test PASSED
type_traits add_volatile_test PASSED
type_traits aligned_storage_empy_test PASSED
type_traits aligned_storage_test PASSED
type_traits alignment_of_a2_test PASSED
type_traits alignment_of_test PASSED
type_traits common_type_2_test PASSED
type_traits common_type_fail PASSED
type_traits common_type_test PASSED
type_traits conditional_test PASSED
type_traits decay_test PASSED
type_traits extent_test PASSED
type_traits function_traits_test PASSED
type_traits has_binary_classes0_test PASSED
type_traits has_binary_classes1_test PASSED
type_traits has_binary_classes2_test PASSED
type_traits has_binary_classes3_test PASSED
type_traits has_binary_classes4_test PASSED
type_traits has_binary_classes5_test PASSED
type_traits has_binary_classes6_test PASSED
type_traits has_binary_classes7_test PASSED
type_traits has_binary_classes8_test PASSED
type_traits has_binary_classes9_test PASSED
type_traits has_bit_and_assign_test PASSED
type_traits has_bit_and_test PASSED
type_traits has_bit_or_assign_test PASSED
type_traits has_bit_or_test PASSED
type_traits has_bit_xor_assign_test PASSED
type_traits has_bit_xor_test PASSED
type_traits has_complement_test PASSED
type_traits has_dereference_test PASSED
type_traits has_divides_assign_test PASSED
type_traits has_divides_test PASSED
type_traits has_equal_to_test PASSED
type_traits has_greater_equal_test PASSED
type_traits has_greater_test PASSED
type_traits has_left_shift_assign_test PASSED
type_traits has_left_shift_test PASSED
type_traits has_less_equal_test PASSED
type_traits has_less_test PASSED
type_traits has_logical_and_test PASSED
type_traits has_logical_not_test PASSED
type_traits has_logical_or_test PASSED
type_traits has_minus_assign_test PASSED
type_traits has_minus_test PASSED
type_traits has_modulus_assign_test PASSED
type_traits has_modulus_test PASSED
type_traits has_multiplies_assign_test PASSED
type_traits has_multiplies_test PASSED
type_traits has_negate_test PASSED
type_traits has_not_equal_to_test PASSED
type_traits has_plus_assign_test PASSED
type_traits has_plus_test PASSED
type_traits has_post_decrement_test PASSED
type_traits has_post_increment_test PASSED
type_traits has_postfix_classes0_test PASSED
type_traits has_postfix_classes1_test PASSED
type_traits has_postfix_classes2_test PASSED
type_traits has_postfix_classes3_test PASSED
type_traits has_pre_decrement_test PASSED
type_traits has_pre_increment_test PASSED
type_traits has_prefix_classes0_test PASSED
type_traits has_prefix_classes1_test PASSED
type_traits has_prefix_classes2_test PASSED
type_traits has_prefix_classes3_test PASSED
type_traits has_right_shift_assign_test PASSED
type_traits has_right_shift_test PASSED
type_traits has_unary_minus_test PASSED
type_traits has_unary_plus_test PASSED
type_traits is_abstract_test PASSED
type_traits is_arithmetic_test PASSED
type_traits is_array_test PASSED
type_traits is_base_and_derived_test PASSED
type_traits is_base_of_test PASSED
type_traits is_complex_test PASSED
type_traits is_compound_test PASSED
type_traits is_const_test PASSED
type_traits is_convertible_test PASSED
type_traits is_empty_test PASSED
type_traits is_enum_test PASSED
type_traits is_float_test PASSED
type_traits is_floating_point_test PASSED
type_traits is_function_test PASSED
type_traits is_fundamental_test PASSED
type_traits is_integral_test PASSED
type_traits is_lvalue_reference_test PASSED
type_traits is_member_func_test PASSED
type_traits is_member_obj_test PASSED
type_traits is_member_pointer_test PASSED
type_traits is_object_test PASSED
type_traits is_pointer_test PASSED
type_traits is_polymorphic_test PASSED
type_traits is_reference_test PASSED
type_traits is_rvalue_reference_test PASSED
type_traits is_same_test PASSED
type_traits is_scalar_test PASSED
type_traits is_signed_test PASSED
type_traits is_unsigned_test PASSED
type_traits is_virtual_base_of_test PASSED
type_traits is_void_test PASSED
type_traits is_volatile_test PASSED
type_traits make_signed_test PASSED
type_traits make_unsigned_test PASSED
type_traits promote_basic_test PASSED
type_traits promote_enum_msvc_bug_test PASSED
type_traits promote_enum_test PASSED
type_traits promote_mpl_test PASSED
type_traits rank_test PASSED
type_traits remove_all_extents_test PASSED
type_traits remove_bounds_test PASSED
type_traits remove_const_test PASSED
type_traits remove_cv_test PASSED
type_traits remove_extent_test PASSED
type_traits remove_pointer_test PASSED
type_traits remove_reference_test PASSED
type_traits remove_volatile_test PASSED
type_traits tricky_abstract_type_test PASSED
type_traits tricky_add_pointer_test PASSED
type_traits tricky_function_type_test PASSED
type_traits tricky_incomplete_type_test PASSED
type_traits tricky_is_enum_test PASSED
type_traits tricky_partial_spec_test PASSED
type_traits tricky_rvalue_test PASSED
type_traits type_traits_test PASSED
type_traits type_with_alignment_test PASSED
type_traits udt_specialisations PASSED
type_traits has_nothrow_assign_test FAILED
type_traits has_nothrow_constr_test FAILED
type_traits has_nothrow_copy_test FAILED
type_traits has_operator_new_test FAILED
type_traits has_trivial_assign_test FAILED
type_traits has_trivial_constr_test FAILED
type_traits has_trivial_copy_test FAILED
type_traits has_trivial_destructor_test FAILED
type_traits has_trivial_move_assign_test FAILED
type_traits has_trivial_move_constructor_test FAILED
type_traits has_virtual_destructor_test FAILED
type_traits is_class_test FAILED
type_traits is_copy_constructible_test FAILED
type_traits is_nothrow_move_assignable_test FAILED
type_traits is_nothrow_move_constructible_test FAILED
type_traits is_pod_test FAILED
type_traits is_stateless_test FAILED
type_traits is_union_test FAILED
typeof data_member_emulation PASSED
typeof data_member_native PASSED
typeof function_binding_emulation PASSED
typeof function_binding_native PASSED
typeof function_emulation PASSED
typeof function_native PASSED
typeof function_ptr_emulation PASSED
typeof function_ptr_from_tpl_emulation PASSED
typeof function_ptr_from_tpl_native PASSED
typeof function_ptr_native PASSED
typeof function_ref_emulation PASSED
typeof function_ref_native PASSED
typeof member_function_emulation PASSED
typeof member_function_native PASSED
typeof modifiers_emulation PASSED
typeof modifiers_native PASSED
typeof nested_typedef_emulation PASSED
typeof nested_typedef_native PASSED
typeof noncopyable_emulation PASSED
typeof noncopyable_native PASSED
typeof odr_emulation PASSED
typeof odr_native PASSED
typeof odr_no_uns PASSED
typeof std_emulation PASSED
typeof std_native PASSED
typeof template_dependent_emulation PASSED
typeof template_dependent_native PASSED
typeof template_enum_emulation PASSED
typeof template_enum_native PASSED
typeof template_int_emulation PASSED
typeof template_int_native PASSED
typeof template_multiword_emulation PASSED
typeof template_multiword_native PASSED
typeof template_tpl_emulation PASSED
typeof template_tpl_native PASSED
typeof template_type_emulation PASSED
typeof template_type_native PASSED
typeof type_emulation PASSED
typeof type_native PASSED
units fail_add_temperature PASSED
units fail_adl_detail PASSED
units fail_base_dimension PASSED
units fail_heterogeneous_unit PASSED
units fail_implicit_conversion PASSED
units fail_quantity_add PASSED
units fail_quantity_add_assign PASSED
units fail_quantity_assign PASSED
units fail_quantity_construct PASSED
units fail_quantity_non_unit PASSED
units fail_quantity_scalar_add PASSED
units fail_quantity_scalar_sub PASSED
units fail_quantity_sub_assign PASSED
units fail_quantity_subtract PASSED
units fail_quantity_unit_add PASSED
units fail_quantity_unit_subtract PASSED
units fail_scalar_quantity_add PASSED
units fail_scalar_quantity_sub PASSED
units fail_unit_quantity_add PASSED
units fail_unit_quantity_subtract PASSED
units test_absolute PASSED
units test_base_dimension PASSED
units test_cmath PASSED
units test_complicated_system PASSED
units test_constants PASSED
units test_conversion PASSED
units test_custom_unit PASSED
units test_default_conversion PASSED
units test_dimensionless_ice1 PASSED
units test_dimensionless_ice2 PASSED
units test_dimensionless_quantity PASSED
units test_implicit_conversion PASSED
units test_lambda PASSED
units test_limits PASSED
units test_mixed_value_types PASSED
units test_negative_denominator PASSED
units test_output PASSED
units test_predicates PASSED
units test_quantity PASSED
units test_reduce_unit PASSED
units test_scaled_conversion PASSED
units test_scaled_unit PASSED
units test_trig PASSED
units test_unit PASSED
units test_unscale PASSED
unordered allocator_traits PASSED
unordered assign_exception_tests PASSED
unordered assign_tests PASSED
unordered at_tests PASSED
unordered bmove_assign PASSED
unordered bmove_compile_map PASSED
unordered bmove_compile_set PASSED
unordered bmove_copy PASSED
unordered bmove_move PASSED
unordered bucket_tests PASSED
unordered compile_map PASSED
unordered compile_set PASSED
unordered constructor_exception_tests PASSED
unordered constructor_tests PASSED
unordered copy_exception_tests PASSED
unordered copy_tests PASSED
unordered equality_tests PASSED
unordered equivalent_keys_tests PASSED
unordered erase_equiv_tests PASSED
unordered erase_exception_tests PASSED
unordered erase_tests PASSED
unordered find_tests PASSED
unordered fwd_map_test PASSED
unordered fwd_set_test PASSED
unordered incomplete_test PASSED
unordered insert_exception_tests PASSED
unordered insert_stable_tests PASSED
unordered insert_tests PASSED
unordered link_test_1 PASSED
unordered load_factor_tests PASSED
unordered minimal_allocator PASSED
unordered move_tests PASSED
unordered noexcept_tests PASSED
unordered rehash_exception_tests PASSED
unordered rehash_tests PASSED
unordered simple_tests PASSED
unordered swap_exception_tests PASSED
unordered swap_tests PASSED
unordered unnecessary_copy_tests FAILED
utility abstract PASSED
utility addressof_fn_test PASSED
utility addressof_test PASSED
utility addressof_test2 PASSED
utility array_of_array_of_class PASSED
utility array_of_array_of_int PASSED
utility array_of_class PASSED
utility array_of_int PASSED
utility array_of_template PASSED
utility assert_test PASSED
utility base_from_member_test PASSED
utility binary_search_test PASSED
utility binary_test PASSED
utility call_traits_test PASSED
utility checked_delete_test PASSED
utility compressed_pair_test PASSED
utility constructors PASSED
utility current_function_test PASSED
utility dummy_arg_disambiguation PASSED
utility explicit_operator_bool PASSED
utility explicit_operator_bool_compile_fail_conv_int PASSED
utility explicit_operator_bool_compile_fail_conv_pvoid PASSED
utility explicit_operator_bool_compile_fail_delete PASSED
utility explicit_operator_bool_compile_fail_shift