Topic
1 reply Latest Post - ‏2012-06-08T16:43:29Z by Prettypadhu
Prettypadhu
Prettypadhu
4 Posts
ACCEPTED ANSWER

Pinned topic Getting exception while enabling the features in FEP 3

‏2012-06-08T16:16:36Z |
Hi,

While enabling the features in FEP 3, we are getting this error.

WASX7341W: No "save" was performed before the interactive scripting session exited; configuration changes will not be saved.

Tried a lot of googling and other searches, but nothing helped.
Updated on 2012-06-08T16:43:29Z at 2012-06-08T16:43:29Z by Prettypadhu
  • Prettypadhu
    Prettypadhu
    4 Posts
    ACCEPTED ANSWER

    Re: Getting exception while enabling the features in FEP 3

    ‏2012-06-08T16:43:29Z  in response to Prettypadhu
    Here is the complete log set

    ADMA5065E: Exception in FileMergeTask org.eclipse.jst.j2ee.commonarchivecore.internal.exception.SaveFailureException: WalletServicesHTTPInterface.war.
    ADMA0185W: An update application operation failed and the configuration session could not be restored to its state before the operation was initiated. The configuration session is in an inconsistent state, and changes made in the session should be discarded.
    ADMA5011I: The cleanup of the temp directory for application WC_MBPDev01 is complete.
    Update of WC_MBPDev01 has ended.
    WASX7017E: Exception received while running file "/opt/IBM/WebSphere/CommerceServer70/components/common/temp/enableFeature.jacl"; exception information: com.ibm.ws.scripting.ScriptingException: WASX7418E: Application update for WC_MBPDev01 failed: see previous messages for details.

    WASX7341W: No "save" was performed before the interactive scripting session exited; configuration changes will not be saved.

    BUILD FAILED

    /opt/IBM/WebSphere/CommerceServer70/components/common/xml/enableFeature.xml:98: The following error occurred while executing this line:
    /opt/IBM/WebSphere/CommerceServer70/components/common/xml/enableFeature.xml:182: The following error occurred while executing this line:
    /opt/IBM/WebSphere/CommerceServer70/components/common/xml/applicationTasks.xml:40: The following error occurred while executing this line:
    /opt/IBM/WebSphere/CommerceServer70/components/common/xml/applicationTasks.xml:106: The following error occurred while executing this line:
    /opt/IBM/WebSphere/CommerceServer70/components/common/xml/serverEnablementTasks.xml:313: Java returned: 105
    at org.apache.tools.ant.ProjectHelper.addLocationToBuildException(ProjectHelper.java:539)
    at org.apache.tools.ant.taskdefs.Ant.execute(Ant.java:384)
    at org.apache.tools.ant.taskdefs.CallTarget.execute(CallTarget.java:107)
    at org.apache.tools.ant.UnknownElement.execute(UnknownElement.java:275)
    at org.apache.tools.ant.Task.perform(Task.java:364)
    at org.apache.tools.ant.taskdefs.Sequential.execute(Sequential.java:64)
    at net.sf.antcontrib.logic.IfTask.execute(IfTask.java:217)
    at sun.reflect.NativeMethodAccessorImpl.invoke0(Native Method)
    at sun.reflect.NativeMethodAccessorImpl.invoke(NativeMethodAccessorImpl.java:60)
    at sun.reflect.DelegatingMethodAccessorImpl.invoke(DelegatingMethodAccessorImpl.java:37)
    at java.lang.reflect.Method.invoke(Method.java:611)
    at org.apache.tools.ant.TaskAdapter.execute(TaskAdapter.java:123)
    at org.apache.tools.ant.UnknownElement.execute(UnknownElement.java:275)
    at org.apache.tools.ant.Task.perform(Task.java:364)
    at org.apache.tools.ant.Target.execute(Target.java:341)
    at org.apache.tools.ant.Target.performTasks(Target.java:369)
    at org.apache.tools.ant.Project.executeSortedTargets(Project.java:1216)
    at org.apache.tools.ant.Project.executeTarget(Project.java:1185)
    at org.apache.tools.ant.helper.DefaultExecutor.executeTargets(DefaultExecutor.java:40)
    at org.apache.tools.ant.Project.executeTargets(Project.java:1068)
    at org.apache.tools.ant.Main.runBuild(Main.java:668)
    at org.apache.tools.ant.Main.startAnt(Main.java:187)
    at org.apache.tools.ant.Main.start(Main.java:150)
    at com.ibm.commerce.config.ant.server.AntLauncher.main(AntLauncher.java:280)
    at sun.reflect.NativeMethodAccessorImpl.invoke0(Native Method)
    at sun.reflect.NativeMethodAccessorImpl.invoke(NativeMethodAccessorImpl.java:60)
    at sun.reflect.DelegatingMethodAccessorImpl.invoke(DelegatingMethodAccessorImpl.java:37)
    at java.lang.reflect.Method.invoke(Method.java:611)
    at com.ibm.ws.bootstrap.WSLauncher.main(WSLauncher.java:267)