Topic
  • 2 replies
  • Latest Post - ‏2012-11-29T17:29:37Z by SystemAdmin
snxdev
snxdev
31 Posts

Pinned topic Update Installer for WAS 7 failed

‏2011-09-13T09:35:54Z |
Hi, i'm trying to update my WAS 7.0.0.13 to 7.0.0.19 and i get the following

Install, com.ibm.ws.install.ni.ismp.actions.InstallNIFPackage, err, com.ibm.ws.install.ni.framework.fileactions.NIFFileActionIOException: The symbolic link from file /C:/IBM/SDP/runtimes/updi_v70/java/jre/bin/ControlPanel to file jcontrol could not be created.
at com.ibm.ws.install.ni.framework.fileactions.AddSymLinkFileActionPlugin.execute(AddSymLinkFileActionPlugin.java:81)
at com.ibm.ws.install.ni.framework.fileactions.FileActionPlugin.executeFileAction(FileActionPlugin.java:54)
at com.ibm.ws.install.ni.updi.component.was.ComponentFileActions.execute(ComponentFileActions.java:95)
at com.ibm.ws.install.ni.updi.component.was.ComponentDeployAction.execute(ComponentDeployAction.java:48)
at com.ibm.ws.install.ni.updi.component.was.UpdateComponent.execute(UpdateComponent.java:93)
at com.ibm.ws.install.ni.framework.component.ComponentAction.executeComponentActions(ComponentAction.java:215)
at com.ibm.ws.install.ni.framework.component.ComponentAction.executeComponentActions(ComponentAction.java:75)
at com.ibm.ws.install.ni.framework.install.NIFPackageApplicationPlugin.performUpgrade(NIFPackageApplicationPlugin.java:548)
at com.ibm.ws.install.ni.framework.install.NIFPackageApplicationPlugin.execute(NIFPackageApplicationPlugin.java:118)
at com.ibm.ws.install.ni.framework.satellites.DeploySatellitesPlugin.installSatellites(DeploySatellitesPlugin.java:316)
at com.ibm.ws.install.ni.framework.satellites.DeploySatellitesPlugin.execute(DeploySatellitesPlugin.java:158)
at com.ibm.ws.install.ni.ismp.actions.InstallNIFPackage.execute(InstallNIFPackage.java:107)
at com.installshield.wizard.RunnableWizardBeanContext.run(RunnableWizardBeanContext.java:21)

(13 Sep 2011 11:30:45 AM), Install, com.ibm.ws.install.ni.ismp.actions.InstallNIFPackage, err, Symbolic linking C:\IBM\SDP\runtimes\updi_v70\java\jre\bin\ControlPanel->jcontrol failed as ln command was not found.
(13 Sep 2011 11:30:45 AM), Install, com.ibm.ws.install.ni.ismp.actions.InstallNIFPackage, err, The symbolic link from file /C:/IBM/SDP/runtimes/updi_v70/java/jre/bin/ControlPanel to file jcontrol could not be created.
(13 Sep 2011 11:30:45 AM), Install, com.ibm.ws.install.ni.ismp.actions.InstallNIFPackage, err, com.ibm.ws.install.ni.framework.NIFException: The symbolic link from file /C:/IBM/SDP/runtimes/updi_v70/java/jre/bin/ControlPanel to file jcontrol could not be created.
at com.ibm.ws.install.ni.framework.install.NIFPackageApplicationPlugin.performUpgrade(NIFPackageApplicationPlugin.java:600)
at com.ibm.ws.install.ni.framework.install.NIFPackageApplicationPlugin.execute(NIFPackageApplicationPlugin.java:118)
at com.ibm.ws.install.ni.framework.satellites.DeploySatellitesPlugin.installSatellites(DeploySatellitesPlugin.java:316)
at com.ibm.ws.install.ni.framework.satellites.DeploySatellitesPlugin.execute(DeploySatellitesPlugin.java:158)
at com.ibm.ws.install.ni.ismp.actions.InstallNIFPackage.execute(InstallNIFPackage.java:107)
at com.installshield.wizard.RunnableWizardBeanContext.run(RunnableWizardBeanContext.java:21)
Caused by: com.ibm.ws.install.ni.framework.fileactions.NIFFileActionIOException: The symbolic link from file /C:/IBM/SDP/runtimes/updi_v70/java/jre/bin/ControlPanel to file jcontrol could not be created.
at com.ibm.ws.install.ni.framework.fileactions.AddSymLinkFileActionPlugin.execute(AddSymLinkFileActionPlugin.java:81)
at com.ibm.ws.install.ni.framework.fileactions.FileActionPlugin.executeFileAction(FileActionPlugin.java:54)
at com.ibm.ws.install.ni.updi.component.was.ComponentFileActions.execute(ComponentFileActions.java:95)
at com.ibm.ws.install.ni.updi.component.was.ComponentDeployAction.execute(ComponentDeployAction.java:48)
at com.ibm.ws.install.ni.updi.component.was.UpdateComponent.execute(UpdateComponent.java:93)
at com.ibm.ws.install.ni.framework.component.ComponentAction.executeComponentActions(ComponentAction.java:215)
at com.ibm.ws.install.ni.framework.component.ComponentAction.executeComponentActions(ComponentAction.java:75)
at com.ibm.ws.install.ni.framework.install.NIFPackageApplicationPlugin.performUpgrade(NIFPackageApplicationPlugin.java:548)
... 5 more
Updated on 2012-11-29T17:29:37Z at 2012-11-29T17:29:37Z by SystemAdmin
  • SystemAdmin
    SystemAdmin
    14225 Posts

    Re: Update Installer for WAS 7 failed

    ‏2012-11-29T05:26:21Z  
    Hi ,
    Need an urgent solution on this problem.
    Any help is appreciable.
  • SystemAdmin
    SystemAdmin
    14225 Posts

    Re: Update Installer for WAS 7 failed

    ‏2012-11-29T17:29:37Z  
    Hi ,
    Need an urgent solution on this problem.
    Any help is appreciable.
    Perhaps the following page might help:

    Re-installing Installation Manager without removing IBM installed products when Installation Manager fails to start or hangs or is unresponsive