Topic
  • 1 reply
  • Latest Post - ‏2018-09-02T21:49:38Z by IgorMonteiro
santhoshkumar.patnana
1 Post

Pinned topic Websphere Commerce Build failed

‏2018-08-29T05:38:46Z | wcs

HI All ,

 

I am facing an issue  while doing the build process in my commerce server  . It is throwing java return 1 as error , I have verified the build.xml file and it seems good . Please find the log file and help me 

 

Setting project property: source.dir -> /wc/wcbd/source/2018-08-29-MRF17APR-3_B1.0
Setting project property: java.vm.info -> JRE 1.6.0 IBM J9 2.4 Linux amd64-64 jvmxa6460sr16fp20-20151221_282799 (JIT enabled, AOT enabled)
J9VM - 20151221_282799
JIT  - r9_20151217_107718
GC   - GA24_Java6_SR16_20151221_0938_B282799
Setting project property: open.laszlo.web.module.list -> LOBTools
Setting project property: DSTAMP -> 20180829
Setting project property: TSTAMP -> 0053
Setting project property: sun.java.launcher.pid -> 19092
Setting project property: user.name -> wcuser
Setting project property: java.util.prefs.PreferencesFactory -> java.util.prefs.FileSystemPreferencesFactory
Setting project property: ejb.bin.dir -> ejbModule
Setting project property: dist.toolkit.dir -> /wc/wcbd/dist/toolkit
Setting project property: com.ibm.util.extralibs.properties -> 
Setting project property: log.dir -> /wc/wcbd/logs/2018-08-29-MRF17APR-3_B1.0-20180829125332
Setting project property: java.awt.graphicsenv -> sun.awt.X11GraphicsEnvironment
Setting project property: java.src.dir -> src
Setting project property: com.ibm.vm.bitmode -> 64
Setting project property: java.runtime.name -> Java(TM) SE Runtime Environment
Setting project property: os.arch -> amd64
Setting project property: java.awt.printerjob -> sun.print.PSPrinterJob
Setting project property: java.library.path -> /opt/IBM/WebSphere/AppServer/java/jre/lib/amd64/default:/opt/IBM/WebSphere/AppServer/java/jre/lib/amd64:/opt/ibm/db2/V9.7/lib64:/opt/IBM/WebSphere/CommerceServer70/bin:/opt/IBM/WebSphere/CommerceServer70/bin:/opt/ibm/db2/V9.7/lib64:/opt/IBM/WebSphere/CommerceServer70/bin:/opt/IBM/WebSphere/CommerceServer70/bin:/home/db2inst1/sqllib/lib64:/home/db2inst1/sqllib/lib32:/usr/lib
Setting project property: run.mail.failure -> true
Setting project property: java.specification.vendor -> Sun Microsystems Inc.
Setting project property: web.bin.dir -> WebContent/WEB-INF/classes
Setting project property: java.vm.specification.name -> Java Virtual Machine Specification
Setting project property: user.language -> en
Setting project property: java.vendor.url -> http://www.ibm.com/
Setting project property: ear.dir.includes -> 
Setting project property: java.compiler -> j9jit24
Setting project property: sun.cpu.endian -> little
Setting project property: log.zip.file -> /wc/wcbd/logs/2018-08-29-MRF17APR-3_B1.0-20180829125332/wcbd-build-log-2018-08-29-MRF17APR-3_B1.0.zip
Setting project property: imported.classes.dir -> ImportedClasses
Setting project property: java.vm.version -> 2.4
Setting project property: run.clean.working.dir -> false
Setting project property: deploy.server.target.env.list -> 
Setting project property: java.jcl.version -> 20160104_01
Setting project property: ibm.signalhandling.rs -> false
Setting project property: java.home -> /opt/IBM/WebSphere/AppServer/java/jre
Setting project property: run.package.server -> true
Setting project property: java.endorsed.dirs -> /opt/IBM/WebSphere/AppServer/java/jre/lib/endorsed
Setting project property: web.src.dir -> src
Setting project property: working.compile.dir -> /wc/wcbd/working/compile
Setting project property: stack.trace -> /wc/wcbd/wcbd-build.xml:133: The following error occurred while executing this line:
/wc/wcbd/wcbd-build.xml:175: The following error occurred while executing this line:
/wc/wcbd/wcbd-build-common.xml:396: The following error occurred while executing this line:
/wc/wcbd/wcbd-build-common.xml:476: The following error occurred while executing this line:
/wc/wcbd/wcbd-build-common.xml:519: The following error occurred while executing this line:
/wc/wcbd/wcbd-build-common.xml:690: Java returned: 1
at org.apache.tools.ant.ProjectHelper.addLocationToBuildException(ProjectHelper.java:508)
at org.apache.tools.ant.taskdefs.Ant.execute(Ant.java:418)
at org.apache.tools.ant.UnknownElement.execute(UnknownElement.java:288)
at sun.reflect.GeneratedMethodAccessor3.invoke(Unknown Source)
at sun.reflect.DelegatingMethodAccessorImpl.invoke(DelegatingMethodAccessorImpl.java:37)
at java.lang.reflect.Method.invoke(Method.java:611)
at org.apache.tools.ant.dispatch.DispatchUtils.execute(DispatchUtils.java:106)
at org.apache.tools.ant.Task.perform(Task.java:348)
at org.apache.tools.ant.taskdefs.Sequential.execute(Sequential.java:62)
at sun.reflect.NativeMethodAccessorImpl.invoke0(Native Method)
at sun.reflect.NativeMethodAccessorImpl.invoke(NativeMethodAccessorImpl.java:60)
at sun.reflect.DelegatingMethodAccessorImpl.invoke(DelegatingMethodAccessorImpl.java:37)
at java.lang.reflect.Method.invoke(Method.java:611)
at org.apache.tools.ant.dispatch.DispatchUtils.execute(DispatchUtils.java:106)
at org.apache.tools.ant.Task.perform(Task.java:348)
at net.sf.antcontrib.logic.TryCatchTask.execute(TryCatchTask.java:207)
at org.apache.tools.ant.UnknownElement.execute(UnknownElement.java:288)
at sun.reflect.GeneratedMethodAccessor3.invoke(Unknown Source)
at sun.reflect.DelegatingMethodAccessorImpl.invoke(DelegatingMethodAccessorImpl.java:37)
at java.lang.reflect.Method.invoke(Method.java:611)
at org.apache.tools.ant.dispatch.DispatchUtils.execute(DispatchUtils.java:106)
at org.apache.tools.ant.Task.perform(Task.java:348)
at org.apache.tools.ant.Target.execute(Target.java:357)
at org.apache.tools.ant.Target.performTasks(Target.java:385)
at org.apache.tools.ant.Project.executeSortedTargets(Project.java:1337)
at org.apache.tools.ant.Project.executeTarget(Project.java:1306)
at org.apache.tools.ant.helper.DefaultExecutor.executeTargets(DefaultExecutor.java:41)
at org.apache.tools.ant.Project.executeTargets(Project.java:1189)
at org.apache.tools.ant.Main.runBuild(Main.java:758)
at org.apache.tools.ant.Main.startAnt(Main.java:217)
at org.apache.tools.ant.launch.Launcher.run(Launcher.java:257)
at org.apache.tools.ant.launch.Launcher.main(Launcher.java:104)
Caused by: /wc/wcbd/wcbd-build.xml:175: The following error occurred while executing this line:
/wc/wcbd/wcbd-build-common.xml:396: The following error occurred while executing this line:
/wc/wcbd/wcbd-build-common.xml:476: The following error occurred while executing this line:
/wc/wcbd/wcbd-build-common.xml:519: The following error occurred while executing this line:
/wc/wcbd/wcbd-build-common.xml:690: Java returned: 1
at org.apache.tools.ant.ProjectHelper.addLocationToBuildException(ProjectHelper.java:508)
at org.apache.tools.ant.taskdefs.Ant.execute(Ant.java:418)
at org.apache.tools.ant.taskdefs.CallTarget.execute(CallTarget.java:105)
at org.apache.tools.ant.UnknownElement.execute(UnknownElement.java:288)
at sun.reflect.GeneratedMethodAccessor3.invoke(Unknown Source)
at sun.reflect.DelegatingMethodAccessorImpl.invoke(DelegatingMethodAccessorImpl.java:37)
at java.lang.reflect.Method.invoke(Method.java:611)
at org.apache.tools.ant.dispatch.DispatchUtils.execute(DispatchUtils.java:106)
at org.apache.tools.ant.Task.perform(Task.java:348)
at org.apache.tools.ant.Target.execute(Target.java:357)
at org.apache.tools.ant.Target.performTasks(Target.java:385)
at org.apache.tools.ant.Project.executeSortedTargets(Project.java:1337)
at org.apache.tools.ant.helper.SingleCheckExecutor.executeTargets(SingleCheckExecutor.java:38)
at org.apache.tools.ant.Project.executeTargets(Project.java:1189)
at org.apache.tools.ant.taskdefs.Ant.execute(Ant.java:416)
... 30 more
Caused by: /wc/wcbd/wcbd-build-common.xml:396: The following error occurred while executing this line:
/wc/wcbd/wcbd-build-common.xml:476: The following error occurred while executing this line:
/wc/wcbd/wcbd-build-common.xml:519: The following error occurred while executing this line:
/wc/wcbd/wcbd-build-common.xml:690: Java returned: 1
at org.apache.tools.ant.ProjectHelper.addLocationToBuildException(ProjectHelper.java:508)
at org.apache.tools.ant.taskdefs.Ant.execute(Ant.java:418)
at org.apache.tools.ant.taskdefs.CallTarget.execute(CallTarget.java:105)
at org.apache.tools.ant.UnknownElement.execute(UnknownElement.java:288)
at sun.reflect.GeneratedMethodAccessor3.invoke(Unknown Source)
at sun.reflect.DelegatingMethodAccessorImpl.invoke(DelegatingMethodAccessorImpl.java:37)
at java.lang.reflect.Method.invoke(Method.java:611)
at org.apache.tools.ant.dispatch.DispatchUtils.execute(DispatchUtils.java:106)
at org.apache.tools.ant.Task.perform(Task.java:348)
at org.apache.tools.ant.Target.execute(Target.java:357)
at org.apache.tools.ant.Target.performTasks(Target.java:385)
at org.apache.tools.ant.Project.executeSortedTargets(Project.java:1337)
at org.apache.tools.ant.helper.SingleCheckExecutor.executeTargets(SingleCheckExecutor.java:38)
at org.apache.tools.ant.Project.executeTargets(Project.java:1189)
at org.apache.tools.ant.taskdefs.Ant.execute(Ant.java:416)
... 43 more
Caused by: /wc/wcbd/wcbd-build-common.xml:476: The following error occurred while executing this line:
/wc/wcbd/wcbd-build-common.xml:519: The following error occurred while executing this line:
/wc/wcbd/wcbd-build-common.xml:690: Java returned: 1
at org.apache.tools.ant.ProjectHelper.addLocationToBuildException(ProjectHelper.java:508)
at org.apache.tools.ant.taskdefs.Ant.execute(Ant.java:418)
at org.apache.tools.ant.taskdefs.CallTarget.execute(CallTarget.java:105)
at sun.reflect.NativeMethodAccessorImpl.invoke0(Native Method)
at sun.reflect.NativeMethodAccessorImpl.invoke(NativeMethodAccessorImpl.java:60)
at sun.reflect.DelegatingMethodAccessorImpl.invoke(DelegatingMethodAccessorImpl.java:37)
at java.lang.reflect.Method.invoke(Method.java:611)
at org.apache.tools.ant.dispatch.DispatchUtils.execute(DispatchUtils.java:106)
at org.apache.tools.ant.Task.perform(Task.java:348)
at org.apache.tools.ant.taskdefs.Sequential.execute(Sequential.java:62)
at net.sf.antcontrib.logic.ForEach.executeSequential(ForEach.java:178)
at net.sf.antcontrib.logic.ForEach.execute(ForEach.java:254)
at org.apache.tools.ant.UnknownElement.execute(UnknownElement.java:288)
at sun.reflect.GeneratedMethodAccessor3.invoke(Unknown Source)
at sun.reflect.DelegatingMethodAccessorImpl.invoke(DelegatingMethodAccessorImpl.java:37)
at java.lang.reflect.Method.invoke(Method.java:611)
at org.apache.tools.ant.dispatch.DispatchUtils.execute(DispatchUtils.java:106)
at org.apache.tools.ant.Task.perform(Task.java:348)
at org.apache.tools.ant.taskdefs.Sequential.execute(Sequential.java:62)
at net.sf.antcontrib.logic.IfTask.execute(IfTask.java:217)
at sun.reflect.GeneratedMethodAccessor35.invoke(Unknown Source)
at sun.reflect.DelegatingMethodAccessorImpl.invoke(DelegatingMethodAccessorImpl.java:37)
at java.lang.reflect.Method.invoke(Method.java:611)
at org.apache.tools.ant.dispatch.DispatchUtils.execute(DispatchUtils.java:106)
at org.apache.tools.ant.TaskAdapter.execute(TaskAdapter.java:154)
at org.apache.tools.ant.UnknownElement.execute(UnknownElement.java:288)
at sun.reflect.GeneratedMethodAccessor3.invoke(Unknown Source)
at sun.reflect.DelegatingMethodAccessorImpl.invoke(DelegatingMethodAccessorImpl.java:37)
at java.lang.reflect.Method.invoke(Method.java:611)
at org.apache.tools.ant.dispatch.DispatchUtils.execute(DispatchUtils.java:106)
at org.apache.tools.ant.Task.perform(Task.java:348)
at org.apache.tools.ant.Target.execute(Target.java:357)
at org.apache.tools.ant.Target.performTasks(Target.java:385)
at org.apache.tools.ant.Project.executeSortedTargets(Project.java:1337)
at org.apache.tools.ant.helper.SingleCheckExecutor.executeTargets(SingleCheckExecutor.java:38)
at org.apache.tools.ant.Project.executeTargets(Project.java:1189)
at org.apache.tools.ant.taskdefs.Ant.execute(Ant.java:416)
... 56 more
Caused by: /wc/wcbd/wcbd-build-common.xml:519: The following error occurred while executing this line:
/wc/wcbd/wcbd-build-common.xml:690: Java returned: 1
at org.apache.tools.ant.ProjectHelper.addLocationToBuildException(ProjectHelper.java:508)
at org.apache.tools.ant.taskdefs.Ant.execute(Ant.java:418)
at org.apache.tools.ant.taskdefs.CallTarget.execute(CallTarget.java:105)
at org.apache.tools.ant.UnknownElement.execute(UnknownElement.java:288)
at sun.reflect.GeneratedMethodAccessor3.invoke(Unknown Source)
at sun.reflect.DelegatingMethodAccessorImpl.invoke(DelegatingMethodAccessorImpl.java:37)
at java.lang.reflect.Method.invoke(Method.java:611)
at org.apache.tools.ant.dispatch.DispatchUtils.execute(DispatchUtils.java:106)
at org.apache.tools.ant.Task.perform(Task.java:348)
at org.apache.tools.ant.taskdefs.Sequential.execute(Sequential.java:62)
at net.sf.antcontrib.logic.IfTask.execute(IfTask.java:197)
at sun.reflect.GeneratedMethodAccessor35.invoke(Unknown Source)
at sun.reflect.DelegatingMethodAccessorImpl.invoke(DelegatingMethodAccessorImpl.java:37)
at java.lang.reflect.Method.invoke(Method.java:611)
at org.apache.tools.ant.dispatch.DispatchUtils.execute(DispatchUtils.java:106)
at org.apache.tools.ant.TaskAdapter.execute(TaskAdapter.java:154)
at org.apache.tools.ant.UnknownElement.execute(UnknownElement.java:288)
at sun.reflect.GeneratedMethodAccessor3.invoke(Unknown Source)
at sun.reflect.DelegatingMethodAccessorImpl.invoke(DelegatingMethodAccessorImpl.java:37)
at java.lang.reflect.Method.invoke(Method.java:611)
at org.apache.tools.ant.dispatch.DispatchUtils.execute(DispatchUtils.java:106)
at org.apache.tools.ant.Task.perform(Task.java:348)
at org.apache.tools.ant.Target.execute(Target.java:357)
at org.apache.tools.ant.Target.performTasks(Target.java:385)
at org.apache.tools.ant.Project.executeSortedTargets(Project.java:1337)
at org.apache.tools.ant.helper.SingleCheckExecutor.executeTargets(SingleCheckExecutor.java:38)
at org.apache.tools.ant.Project.executeTargets(Project.java:1189)
at org.apache.tools.ant.taskdefs.Ant.execute(Ant.java:416)
... 91 more
Caused by: /wc/wcbd/wcbd-build-common.xml:690: Java returned: 1
at org.apache.tools.ant.taskdefs.Java.execute(Java.java:108)
at com.ibm.websphere.ant.tasks.WsEjbDeploy.execute(WsEjbDeploy.java:720)
at org.apache.tools.ant.UnknownElement.execute(UnknownElement.java:288)
at sun.reflect.GeneratedMethodAccessor3.invoke(Unknown Source)
at sun.reflect.DelegatingMethodAccessorImpl.invoke(DelegatingMethodAccessorImpl.java:37)
at java.lang.reflect.Method.invoke(Method.java:611)
at org.apache.tools.ant.dispatch.DispatchUtils.execute(DispatchUtils.java:106)
at org.apache.tools.ant.Task.perform(Task.java:348)
at org.apache.tools.ant.Target.execute(Target.java:357)
at org.apache.tools.ant.Target.performTasks(Target.java:385)
at org.apache.tools.ant.Project.executeSortedTargets(Project.java:1337)
at org.apache.tools.ant.helper.SingleCheckExecutor.executeTargets(SingleCheckExecutor.java:38)
at org.apache.tools.ant.Project.executeTargets(Project.java:1189)
at org.apache.tools.ant.taskdefs.Ant.execute(Ant.java:416)
... 117 more
--- Nested Exception ---
/wc/wcbd/wcbd-build.xml:175: The following error occurred while executing this line:
/wc/wcbd/wcbd-build-common.xml:396: The following error occurred while executing this line:
/wc/wcbd/wcbd-build-common.xml:476: The following error occurred while executing this line:
/wc/wcbd/wcbd-build-common.xml:519: The following error occurred while executing this line:
/wc/wcbd/wcbd-build-common.xml:690: Java returned: 1
at org.apache.tools.ant.ProjectHelper.addLocationToBuildException(ProjectHelper.java:508)
at org.apache.tools.ant.taskdefs.Ant.execute(Ant.java:418)
at org.apache.tools.ant.taskdefs.CallTarget.execute(CallTarget.java:105)
at org.apache.tools.ant.UnknownElement.execute(UnknownElement.java:288)
at sun.reflect.GeneratedMethodAccessor3.invoke(Unknown Source)
at sun.reflect.DelegatingMethodAccessorImpl.invoke(DelegatingMethodAccessorImpl.java:37)
at java.lang.reflect.Method.invoke(Method.java:611)
at org.apache.tools.ant.dispatch.DispatchUtils.execute(DispatchUtils.java:106)
at org.apache.tools.ant.Task.perform(Task.java:348)
at org.apache.tools.ant.Target.execute(Target.java:357)
at org.apache.tools.ant.Target.performTasks(Target.java:385)
at org.apache.tools.ant.Project.executeSortedTargets(Project.java:1337)
at org.apache.tools.ant.helper.SingleCheckExecutor.executeTargets(SingleCheckExecutor.java:38)
at org.apache.tools.ant.Project.executeTargets(Project.java:1189)
at org.apache.tools.ant.taskdefs.Ant.execute(Ant.java:416)
at org.apache.tools.ant.UnknownElement.execute(UnknownElement.java:288)
at sun.reflect.GeneratedMethodAccessor3.invoke(Unknown Source)
at sun.reflect.DelegatingMethodAccessorImpl.invoke(DelegatingMethodAccessorImpl.java:37)
at java.lang.reflect.Method.invoke(Method.java:611)
at org.apache.tools.ant.dispatch.DispatchUtils.execute(DispatchUtils.java:106)
at org.apache.tools.ant.Task.perform(Task.java:348)
at org.apache.tools.ant.taskdefs.Sequential.execute(Sequential.java:62)
at sun.reflect.NativeMethodAccessorImpl.invoke0(Native Method)
at sun.reflect.NativeMethodAccessorImpl.invoke(NativeMethodAccessorImpl.java:60)
at sun.reflect.DelegatingMethodAccessorImpl.invoke(DelegatingMethodAccessorImpl.java:37)
at java.lang.reflect.Method.invoke(Method.java:611)
at org.apache.tools.ant.dispatch.DispatchUtils.execute(DispatchUtils.java:106)
at org.apache.tools.ant.Task.perform(Task.java:348)
at net.sf.antcontrib.logic.TryCatchTask.execute(TryCatchTask.java:207)
at org.apache.tools.ant.UnknownElement.execute(UnknownElement.java:288)
at sun.reflect.GeneratedMethodAccessor3.invoke(Unknown Source)
at sun.reflect.DelegatingMethodAccessorImpl.invoke(DelegatingMethodAccessorImpl.java:37)
at java.lang.reflect.Method.invoke(Method.java:611)
at org.apache.tools.ant.dispatch.DispatchUtils.execute(DispatchUtils.java:106)
at org.apache.tools.ant.Task.perform(Task.java:348)
at org.apache.tools.ant.Target.execute(Target.java:357)
at org.apache.tools.ant.Target.performTasks(Target.java:385)
at org.apache.tools.ant.Project.executeSortedTargets(Project.java:1337)
at org.apache.tools.ant.Project.executeTarget(Project.java:1306)
at org.apache.tools.ant.helper.DefaultExecutor.executeTargets(DefaultExecutor.java:41)
at org.apache.tools.ant.Project.executeTargets(Project.java:1189)
at org.apache.tools.ant.Main.runBuild(Main.java:758)
at org.apache.tools.ant.Main.startAnt(Main.java:217)
at org.apache.tools.ant.launch.Launcher.run(Launcher.java:257)
at org.apache.tools.ant.launch.Launcher.main(Launcher.java:104)
Caused by: /wc/wcbd/wcbd-build-common.xml:396: The following error occurred while executing this line:
/wc/wcbd/wcbd-build-common.xml:476: The following error occurred while executing this line:
/wc/wcbd/wcbd-build-common.xml:519: The following error occurred while executing this line:
/wc/wcbd/wcbd-build-common.xml:690: Java returned: 1
at org.apache.tools.ant.ProjectHelper.addLocationToBuildException(ProjectHelper.java:508)
at org.apache.tools.ant.taskdefs.Ant.execute(Ant.java:418)
at org.apache.tools.ant.taskdefs.CallTarget.execute(CallTarget.java:105)
at org.apache.tools.ant.UnknownElement.execute(UnknownElement.java:288)
at sun.reflect.GeneratedMethodAccessor3.invoke(Unknown Source)
at sun.reflect.DelegatingMethodAccessorImpl.invoke(DelegatingMethodAccessorImpl.java:37)
at java.lang.reflect.Method.invoke(Method.java:611)
at org.apache.tools.ant.dispatch.DispatchUtils.execute(DispatchUtils.java:106)
at org.apache.tools.ant.Task.perform(Task.java:348)
at org.apache.tools.ant.Target.execute(Target.java:357)
at org.apache.tools.ant.Target.performTasks(Target.java:385)
at org.apache.tools.ant.Project.executeSortedTargets(Project.java:1337)
at org.apache.tools.ant.helper.SingleCheckExecutor.executeTargets(SingleCheckExecutor.java:38)
at org.apache.tools.ant.Project.executeTargets(Project.java:1189)
at org.apache.tools.ant.taskdefs.Ant.execute(Ant.java:416)
... 43 more
Caused by: /wc/wcbd/wcbd-build-common.xml:476: The following error occurred while executing this line:
/wc/wcbd/wcbd-build-common.xml:519: The following error occurred while executing this line:
/wc/wcbd/wcbd-build-common.xml:690: Java returned: 1
at org.apache.tools.ant.ProjectHelper.addLocationToBuildException(ProjectHelper.java:508)
at org.apache.tools.ant.taskdefs.Ant.execute(Ant.java:418)
at org.apache.tools.ant.taskdefs.CallTarget.execute(CallTarget.java:105)
at sun.reflect.NativeMethodAccessorImpl.invoke0(Native Method)
at sun.reflect.NativeMethodAccessorImpl.invoke(NativeMethodAccessorImpl.java:60)
at sun.reflect.DelegatingMethodAccessorImpl.invoke(DelegatingMethodAccessorImpl.java:37)
at java.lang.reflect.Method.invoke(Method.java:611)
at org.apache.tools.ant.dispatch.DispatchUtils.execute(DispatchUtils.java:106)
at org.apache.tools.ant.Task.perform(Task.java:348)
at org.apache.tools.ant.taskdefs.Sequential.execute(Sequential.java:62)
at net.sf.antcontrib.logic.ForEach.executeSequential(ForEach.java:178)
at net.sf.antcontrib.logic.ForEach.execute(ForEach.java:254)
at org.apache.tools.ant.UnknownElement.execute(UnknownElement.java:288)
at sun.reflect.GeneratedMethodAccessor3.invoke(Unknown Source)
at sun.reflect.DelegatingMethodAccessorImpl.invoke(DelegatingMethodAccessorImpl.java:37)
at java.lang.reflect.Method.invoke(Method.java:611)
at org.apache.tools.ant.dispatch.DispatchUtils.execute(DispatchUtils.java:106)
at org.apache.tools.ant.Task.perform(Task.java:348)
at org.apache.tools.ant.taskdefs.Sequential.execute(Sequential.java:62)
at net.sf.antcontrib.logic.IfTask.execute(IfTask.java:217)
at sun.reflect.GeneratedMethodAccessor35.invoke(Unknown Source)
at sun.reflect.DelegatingMethodAccessorImpl.invoke(DelegatingMethodAccessorImpl.java:37)
at java.lang.reflect.Method.invoke(Method.java:611)
at org.apache.tools.ant.dispatch.DispatchUtils.execute(DispatchUtils.java:106)
at org.apache.tools.ant.TaskAdapter.execute(TaskAdapter.java:154)
at org.apache.tools.ant.UnknownElement.execute(UnknownElement.java:288)
at sun.reflect.GeneratedMethodAccessor3.invoke(Unknown Source)
at sun.reflect.DelegatingMethodAccessorImpl.invoke(DelegatingMethodAccessorImpl.java:37)
at java.lang.reflect.Method.invoke(Method.java:611)
at org.apache.tools.ant.dispatch.DispatchUtils.execute(DispatchUtils.java:106)
at org.apache.tools.ant.Task.perform(Task.java:348)
at org.apache.tools.ant.Target.execute(Target.java:357)
at org.apache.tools.ant.Target.performTasks(Target.java:385)
at org.apache.tools.ant.Project.executeSortedTargets(Project.java:1337)
at org.apache.tools.ant.helper.SingleCheckExecutor.executeTargets(SingleCheckExecutor.java:38)
at org.apache.tools.ant.Project.executeTargets(Project.java:1189)
at org.apache.tools.ant.taskdefs.Ant.execute(Ant.java:416)
... 56 more
Caused by: /wc/wcbd/wcbd-build-common.xml:519: The following error occurred while executing this line:
/wc/wcbd/wcbd-build-common.xml:690: Java returned: 1
at org.apache.tools.ant.ProjectHelper.addLocationToBuildException(ProjectHelper.java:508)
at org.apache.tools.ant.taskdefs.Ant.execute(Ant.java:418)
at org.apache.tools.ant.taskdefs.CallTarget.execute(CallTarget.java:105)
at org.apache.tools.ant.UnknownElement.execute(UnknownElement.java:288)
at sun.reflect.GeneratedMethodAccessor3.invoke(Unknown Source)
at sun.reflect.DelegatingMethodAccessorImpl.invoke(DelegatingMethodAccessorImpl.java:37)
at java.lang.reflect.Method.invoke(Method.java:611)
at org.apache.tools.ant.dispatch.DispatchUtils.execute(DispatchUtils.java:106)
at org.apache.tools.ant.Task.perform(Task.java:348)
at org.apache.tools.ant.taskdefs.Sequential.execute(Sequential.java:62)
at net.sf.antcontrib.logic.IfTask.execute(IfTask.java:197)
at sun.reflect.GeneratedMethodAccessor35.invoke(Unknown Source)
at sun.reflect.DelegatingMethodAccessorImpl.invoke(DelegatingMethodAccessorImpl.java:37)
at java.lang.reflect.Method.invoke(Method.java:611)
at org.apache.tools.ant.dispatch.DispatchUtils.execute(DispatchUtils.java:106)
at org.apache.tools.ant.TaskAdapter.execute(TaskAdapter.java:154)
at org.apache.tools.ant.UnknownElement.execute(UnknownElement.java:288)
at sun.reflect.GeneratedMethodAccessor3.invoke(Unknown Source)
at sun.reflect.DelegatingMethodAccessorImpl.invoke(DelegatingMethodAccessorImpl.java:37)
at java.lang.reflect.Method.invoke(Method.java:611)
at org.apache.tools.ant.dispatch.DispatchUtils.execute(DispatchUtils.java:106)
at org.apache.tools.ant.Task.perform(Task.java:348)
at org.apache.tools.ant.Target.execute(Target.java:357)
at org.apache.tools.ant.Target.performTasks(Target.java:385)
at org.apache.tools.ant.Project.executeSortedTargets(Project.java:1337)
at org.apache.tools.ant.helper.SingleCheckExecutor.executeTargets(SingleCheckExecutor.java:38)
at org.apache.tools.ant.Project.executeTargets(Project.java:1189)
at org.apache.tools.ant.taskdefs.Ant.execute(Ant.java:416)
... 91 more
Caused by: /wc/wcbd/wcbd-build-common.xml:690: Java returned: 1
at org.apache.tools.ant.taskdefs.Java.execute(Java.java:108)
at com.ibm.websphere.ant.tasks.WsEjbDeploy.execute(WsEjbDeploy.java:720)
at org.apache.tools.ant.UnknownElement.execute(UnknownElement.java:288)
at sun.reflect.GeneratedMethodAccessor3.invoke(Unknown Source)
at sun.reflect.DelegatingMethodAccessorImpl.invoke(DelegatingMethodAccessorImpl.java:37)
at java.lang.reflect.Method.invoke(Method.java:611)
at org.apache.tools.ant.dispatch.DispatchUtils.execute(DispatchUtils.java:106)
at org.apache.tools.ant.Task.perform(Task.java:348)
at org.apache.tools.ant.Target.execute(Target.java:357)
at org.apache.tools.ant.Target.performTasks(Target.java:385)
at org.apache.tools.ant.Project.executeSortedTargets(Project.java:1337)
at org.apache.tools.ant.helper.SingleCheckExecutor.executeTargets(SingleCheckExecutor.java:38)
at org.apache.tools.ant.Project.executeTargets(Project.java:1189)
at org.apache.tools.ant.taskdefs.Ant.execute(Ant.java:416)
... 117 more
--- Nested Exception ---
/wc/wcbd/wcbd-build-common.xml:396: The following error occurred while executing this line:
/wc/wcbd/wcbd-build-common.xml:476: The following error occurred while executing this line:
/wc/wcbd/wcbd-build-common.xml:519: The following error occurred while executing this line:
/wc/wcbd/wcbd-build-common.xml:690: Java returned: 1
at org.apache.tools.ant.ProjectHelper.addLocationToBuildException(ProjectHelper.java:508)
at org.apache.tools.ant.taskdefs.Ant.execute(Ant.java:418)
at org.apache.tools.ant.taskdefs.CallTarget.execute(CallTarget.java:105)
at org.apache.tools.ant.UnknownElement.execute(UnknownElement.java:288)
at sun.reflect.GeneratedMethodAccessor3.invoke(Unknown Source)
at sun.reflect.DelegatingMethodAccessorImpl.invoke(DelegatingMethodAccessorImpl.java:37)
at java.lang.reflect.Method.invoke(Method.java:611)
at org.apache.tools.ant.dispatch.DispatchUtils.execute(DispatchUtils.java:106)
at org.apache.tools.ant.Task.perform(Task.java:348)
at org.apache.tools.ant.Target.execute(Target.java:357)
at org.apache.tools.ant.Target.performTasks(Target.java:385)
at org.apache.tools.ant.Project.executeSortedTargets(Project.java:1337)
at org.apache.tools.ant.helper.SingleCheckExecutor.executeTargets(SingleCheckExecutor.java:38)
at org.apache.tools.ant.Project.executeTargets(Project.java:1189)
at org.apache.tools.ant.taskdefs.Ant.execute(Ant.java:416)
at org.apache.tools.ant.taskdefs.CallTarget.execute(CallTarget.java:105)
at org.apache.tools.ant.UnknownElement.execute(UnknownElement.java:288)
at sun.reflect.GeneratedMethodAccessor3.invoke(Unknown Source)
at sun.reflect.DelegatingMethodAccessorImpl.invoke(DelegatingMethodAccessorImpl.java:37)
at java.lang.reflect.Method.invoke(Method.java:611)
at org.apache.tools.ant.dispatch.DispatchUtils.execute(DispatchUtils.java:106)
at org.apache.tools.ant.Task.perform(Task.java:348)
at org.apache.tools.ant.Target.execute(Target.java:357)
at org.apache.tools.ant.Target.performTasks(Target.java:385)
at org.apache.tools.ant.Project.executeSortedTargets(Project.java:1337)
at org.apache.tools.ant.helper.SingleCheckExecutor.executeTargets(SingleCheckExecutor.java:38)
at org.apache.tools.ant.Project.executeTargets(Project.java:1189)
at org.apache.tools.ant.taskdefs.Ant.execute(Ant.java:416)
at org.apache.tools.ant.UnknownElement.execute(UnknownElement.java:288)
at sun.reflect.GeneratedMethodAccessor3.invoke(Unknown Source)
at sun.reflect.DelegatingMethodAccessorImpl.invoke(DelegatingMethodAccessorImpl.java:37)
at java.lang.reflect.Method.invoke(Method.java:611)
at org.apache.tools.ant.dispatch.DispatchUtils.execute(DispatchUtils.java:106)
at org.apache.tools.ant.Task.perform(Task.java:348)
at org.apache.tools.ant.taskdefs.Sequential.execute(Sequential.java:62)
at sun.reflect.NativeMethodAccessorImpl.invoke0(Native Method)
at sun.reflect.NativeMethodAccessorImpl.invoke(NativeMethodAccessorImpl.java:60)
at sun.reflect.DelegatingMethodAccessorImpl.invoke(DelegatingMethodAccessorImpl.java:37)
at java.lang.reflect.Method.invoke(Method.java:611)
at org.apache.tools.ant.dispatch.DispatchUtils.execute(DispatchUtils.java:106)
at org.apache.tools.ant.Task.perform(Task.java:348)
at net.sf.antcontrib.logic.TryCatchTask.execute(TryCatchTask.java:207)
at org.apache.tools.ant.UnknownElement.execute(UnknownElement.java:288)
at sun.reflect.GeneratedMethodAccessor3.invoke(Unknown Source)
at sun.reflect.DelegatingMethodAccessorImpl.invoke(DelegatingMethodAccessorImpl.java:37)
at java.lang.reflect.Method.invoke(Method.java:611)
at org.apache.tools.ant.dispatch.DispatchUtils.execute(DispatchUtils.java:106)
at org.apache.tools.ant.Task.perform(Task.java:348)
at org.apache.tools.ant.Target.execute(Target.java:357)
at org.apache.tools.ant.Target.performTasks(Target.java:385)
at org.apache.tools.ant.Project.executeSortedTargets(Project.java:1337)
at org.apache.tools.ant.Project.executeTarget(Project.java:1306)
at org.apache.tools.ant.helper.DefaultExecutor.executeTargets(DefaultExecutor.java:41)
at org.apache.tools.ant.Project.executeTargets(Project.java:1189)
at org.apache.tools.ant.Main.runBuild(Main.java:758)
at org.apache.tools.ant.Main.startAnt(Main.java:217)
at org.apache.tools.ant.launch.Launcher.run(Launcher.java:257)
at org.apache.tools.ant.launch.Launcher.main(Launcher.java:104)
Caused by: /wc/wcbd/wcbd-build-common.xml:476: The following error occurred while executing this line:
/wc/wcbd/wcbd-build-common.xml:519: The following error occurred while executing this line:
/wc/wcbd/wcbd-build-common.xml:690: Java returned: 1
at org.apache.tools.ant.ProjectHelper.addLocationToBuildException(ProjectHelper.java:508)
at org.apache.tools.ant.taskdefs.Ant.execute(Ant.java:418)
at org.apache.tools.ant.taskdefs.CallTarget.execute(CallTarget.java:105)
at sun.reflect.NativeMethodAccessorImpl.invoke0(Native Method)
at sun.reflect.NativeMethodAccessorImpl.invoke(NativeMethodAccessorImpl.java:60)
at sun.reflect.DelegatingMethodAccessorImpl.invoke(DelegatingMethodAccessorImpl.java:37)
at java.lang.reflect.Method.invoke(Method.java:611)
at org.apache.tools.ant.dispatch.DispatchUtils.execute(DispatchUtils.java:106)
at org.apache.tools.ant.Task.perform(Task.java:348)
at org.apache.tools.ant.taskdefs.Sequential.execute(Sequential.java:62)
at net.sf.antcontrib.logic.ForEach.executeSequential(ForEach.java:178)
at net.sf.antcontrib.logic.ForEach.execute(ForEach.java:254)
at org.apache.tools.ant.UnknownElement.execute(UnknownElement.java:288)
at sun.reflect.GeneratedMethodAccessor3.invoke(Unknown Source)
at sun.reflect.DelegatingMethodAccessorImpl.invoke(DelegatingMethodAccessorImpl.java:37)
at java.lang.reflect.Method.invoke(Method.java:611)
at org.apache.tools.ant.dispatch.DispatchUtils.execute(DispatchUtils.java:106)
at org.apache.tools.ant.Task.perform(Task.java:348)
at org.apache.tools.ant.taskdefs.Sequential.execute(Sequential.java:62)
at net.sf.antcontrib.logic.IfTask.execute(IfTask.java:217)
at sun.reflect.GeneratedMethodAccessor35.invoke(Unknown Source)
at sun.reflect.DelegatingMethodAccessorImpl.invoke(DelegatingMethodAccessorImpl.java:37)
at java.lang.reflect.Method.invoke(Method.java:611)
at org.apache.tools.ant.dispatch.DispatchUtils.execute(DispatchUtils.java:106)
at org.apache.tools.ant.TaskAdapter.execute(TaskAdapter.java:154)
at org.apache.tools.ant.UnknownElement.execute(UnknownElement.java:288)
at sun.reflect.GeneratedMethodAccessor3.invoke(Unknown Source)
at sun.reflect.DelegatingMethodAccessorImpl.invoke(DelegatingMethodAccessorImpl.java:37)
at java.lang.reflect.Method.invoke(Method.java:611)
at org.apache.tools.ant.dispatch.DispatchUtils.execute(DispatchUtils.java:106)
at org.apache.tools.ant.Task.perform(Task.java:348)
at org.apache.tools.ant.Target.execute(Target.java:357)
at org.apache.tools.ant.Target.performTasks(Target.java:385)
at org.apache.tools.ant.Project.executeSortedTargets(Project.java:1337)
at org.apache.tools.ant.helper.SingleCheckExecutor.executeTargets(SingleCheckExecutor.java:38)
at org.apache.tools.ant.Project.executeTargets(Project.java:1189)
at org.apache.tools.ant.taskdefs.Ant.execute(Ant.java:416)
... 56 more
Caused by: /wc/wcbd/wcbd-build-common.xml:519: The following error occurred while executing this line:
/wc/wcbd/wcbd-build-common.xml:690: Java returned: 1
at org.apache.tools.ant.ProjectHelper.addLocationToBuildException(ProjectHelper.java:508)
at org.apache.tools.ant.taskdefs.Ant.execute(Ant.java:418)
at org.apache.tools.ant.taskdefs.CallTarget.execute(CallTarget.java:105)
at org.apache.tools.ant.UnknownElement.execute(UnknownElement.java:288)
at sun.reflect.GeneratedMethodAccessor3.invoke(Unknown Source)
at sun.reflect.DelegatingMethodAccessorImpl.invoke(DelegatingMethodAccessorImpl.java:37)
at java.lang.reflect.Method.invoke(Method.java:611)
at org.apache.tools.ant.dispatch.DispatchUtils.execute(DispatchUtils.java:106)
at org.apache.tools.ant.Task.perform(Task.java:348)
at org.apache.tools.ant.taskdefs.Sequential.execute(Sequential.java:62)
at net.sf.antcontrib.logic.IfTask.execute(IfTask.java:197)
at sun.reflect.GeneratedMethodAccessor35.invoke(Unknown Source)
at sun.reflect.DelegatingMethodAccessorImpl.invoke(DelegatingMethodAccessorImpl.java:37)
at java.lang.reflect.Method.invoke(Method.java:611)
at org.apache.tools.ant.dispatch.DispatchUtils.execute(DispatchUtils.java:106)
at org.apache.tools.ant.TaskAdapter.execute(TaskAdapter.java:154)
at org.apache.tools.ant.UnknownElement.execute(UnknownElement.java:288)
at sun.reflect.GeneratedMethodAccessor3.invoke(Unknown Source)
at sun.reflect.DelegatingMethodAccessorImpl.invoke(DelegatingMethodAccessorImpl.java:37)
at java.lang.reflect.Method.invoke(Method.java:611)
at org.apache.tools.ant.dispatch.DispatchUtils.execute(DispatchUtils.java:106)
at org.apache.tools.ant.Task.perform(Task.java:348)
at org.apache.tools.ant.Target.execute(Target.java:357)
at org.apache.tools.ant.Target.performTasks(Target.java:385)
at org.apache.tools.ant.Project.executeSortedTargets(Project.java:1337)
at org.apache.tools.ant.helper.SingleCheckExecutor.executeTargets(SingleCheckExecutor.java:38)
at org.apache.tools.ant.Project.executeTargets(Project.java:1189)
at org.apache.tools.ant.taskdefs.Ant.execute(Ant.java:416)
... 91 more
Caused by: /wc/wcbd/wcbd-build-common.xml:690: Java returned: 1
at org.apache.tools.ant.taskdefs.Java.execute(Java.java:108)
at com.ibm.websphere.ant.tasks.WsEjbDeploy.execute(WsEjbDeploy.java:720)
at org.apache.tools.ant.UnknownElement.execute(UnknownElement.java:288)
at sun.reflect.GeneratedMethodAccessor3.invoke(Unknown Source)
at sun.reflect.DelegatingMethodAccessorImpl.invoke(DelegatingMethodAccessorImpl.java:37)
at java.lang.reflect.Method.invoke(Method.java:611)
at org.apache.tools.ant.dispatch.DispatchUtils.execute(DispatchUtils.java:106)
at org.apache.tools.ant.Task.perform(Task.java:348)
at org.apache.tools.ant.Target.execute(Target.java:357)
at org.apache.tools.ant.Target.performTasks(Target.java:385)
at org.apache.tools.ant.Project.executeSortedTargets(Project.java:1337)
at org.apache.tools.ant.helper.SingleCheckExecutor.executeTargets(SingleCheckExecutor.java:38)
at org.apache.tools.ant.Project.executeTargets(Project.java:1189)
at org.apache.tools.ant.taskdefs.Ant.execute(Ant.java:416)
... 117 more
--- Nested Exception ---
/wc/wcbd/wcbd-build-common.xml:476: The following error occurred while executing this line:
/wc/wcbd/wcbd-build-common.xml:519: The following error occurred while executing this line:
/wc/wcbd/wcbd-build-common.xml:690: Java returned: 1
at org.apache.tools.ant.ProjectHelper.addLocationToBuildException(ProjectHelper.java:508)
at org.apache.tools.ant.taskdefs.Ant.execute(Ant.java:418)
at org.apache.tools.ant.taskdefs.CallTarget.execute(CallTarget.java:105)
at sun.reflect.NativeMethodAccessorImpl.invoke0(Native Method)
at sun.reflect.NativeMethodAccessorImpl.invoke(NativeMethodAccessorImpl.java:60)
at sun.reflect.DelegatingMethodAccessorImpl.invoke(DelegatingMethodAccessorImpl.java:37)
at java.lang.reflect.Method.invoke(Method.java:611)
at org.apache.tools.ant.dispatch.DispatchUtils.execute(DispatchUtils.java:106)
at org.apache.tools.ant.Task.perform(Task.java:348)
at org.apache.tools.ant.taskdefs.Sequential.execute(Sequential.java:62)
at net.sf.antcontrib.logic.ForEach.executeSequential(ForEach.java:178)
at net.sf.antcontrib.logic.ForEach.execute(ForEach.java:254)
at org.apache.tools.ant.UnknownElement.execute(UnknownElement.java:288)
at sun.reflect.GeneratedMethodAccessor3.invoke(Unknown Source)
at sun.reflect.DelegatingMethodAccessorImpl.invoke(DelegatingMethodAccessorImpl.java:37)
at java.lang.reflect.Method.invoke(Method.java:611)
at org.apache.tools.ant.dispatch.DispatchUtils.execute(DispatchUtils.java:106)
at org.apache.tools.ant.Task.perform(Task.java:348)
at org.apache.tools.ant.taskdefs.Sequential.execute(Sequential.java:62)
at net.sf.antcontrib.logic.IfTask.execute(IfTask.java:217)
at sun.reflect.GeneratedMethodAccessor35.invoke(Unknown Source)
at sun.reflect.DelegatingMethodAccessorImpl.invoke(DelegatingMethodAccessorImpl.java:37)
at java.lang.reflect.Method.invoke(Method.java:611)
at org.apache.tools.ant.dispatch.DispatchUtils.execute(DispatchUtils.java:106)
at org.apache.tools.ant.TaskAdapter.execute(TaskAdapter.java:154)
at org.apache.tools.ant.UnknownElement.execute(UnknownElement.java:288)
at sun.reflect.GeneratedMethodAccessor3.invoke(Unknown Source)
at sun.reflect.DelegatingMethodAccessorImpl.invoke(DelegatingMethodAccessorImpl.java:37)
at java.lang.reflect.Method.invoke(Method.java:611)
at org.apache.tools.ant.dispatch.DispatchUtils.execute(DispatchUtils.java:106)
at org.apache.tools.ant.Task.perform(Task.java:348)
at org.apache.tools.ant.Target.execute(Target.java:357)
at org.apache.tools.ant.Target.performTasks(Target.java:385)
at org.apache.tools.ant.Project.executeSortedTargets(Project.java:1337)
at org.apache.tools.ant.helper.SingleCheckExecutor.executeTargets(SingleCheckExecutor.java:38)
at org.apache.tools.ant.Project.executeTargets(Project.java:1189)
at org.apache.tools.ant.taskdefs.Ant.execute(Ant.java:416)
at org.apache.tools.ant.taskdefs.CallTarget.execute(CallTarget.java:105)
at org.apache.tools.ant.UnknownElement.execute(UnknownElement.java:288)
at sun.reflect.GeneratedMethodAccessor3.invoke(Unknown Source)
at sun.reflect.DelegatingMethodAccessorImpl.invoke(DelegatingMethodAccessorImpl.java:37)
at java.lang.reflect.Method.invoke(Method.java:611)
at org.apache.tools.ant.dispatch.DispatchUtils.execute(DispatchUtils.java:106)
at org.apache.tools.ant.Task.perform(Task.java:348)
at org.apache.tools.ant.Target.execute(Target.java:357)
at org.apache.tools.ant.Target.performTasks(Target.java:385)
at org.apache.tools.ant.Project.executeSortedTargets(Project.java:1337)
at org.apache.tools.ant.helper.SingleCheckExecutor.executeTargets(SingleCheckExecutor.java:38)
at org.apache.tools.ant.Project.executeTargets(Project.java:1189)
at org.apache.tools.ant.taskdefs.Ant.execute(Ant.java:416)
at org.apache.tools.ant.taskdefs.CallTarget.execute(CallTarget.java:105)
at org.apache.tools.ant.UnknownElement.execute(UnknownElement.java:288)
at sun.reflect.GeneratedMethodAccessor3.invoke(Unknown Source)
at sun.reflect.DelegatingMethodAccessorImpl.invoke(DelegatingMethodAccessorImpl.java:37)
at java.lang.reflect.Method.invoke(Method.java:611)
at org.apache.tools.ant.dispatch.DispatchUtils.execute(DispatchUtils.java:106)
at org.apache.tools.ant.Task.perform(Task.java:348)
at org.apache.tools.ant.Target.execute(Target.java:357)
at org.apache.tools.ant.Target.performTasks(Target.java:385)
at org.apache.tools.ant.Project.executeSortedTargets(Project.java:1337)
at org.apache.tools.ant.helper.SingleCheckExecutor.executeTargets(SingleCheckExecutor.java:38)
at org.apache.tools.ant.Project.executeTargets(Project.java:1189)
at org.apache.tools.ant.taskdefs.Ant.execute(Ant.java:416)
at org.apache.tools.ant.UnknownElement.execute(UnknownElement.java:288)
at sun.reflect.GeneratedMethodAccessor3.invoke(Unknown Source)
at sun.reflect.DelegatingMethodAccessorImpl.invoke(DelegatingMethodAccessorImpl.java:37)
at java.lang.reflect.Method.invoke(Method.java:611)
at org.apache.tools.ant.dispatch.DispatchUtils.execute(DispatchUtils.java:106)
at org.apache.tools.ant.Task.perform(Task.java:348)
at org.apache.tools.ant.taskdefs.Sequential.execute(Sequential.java:62)
at sun.reflect.NativeMethodAccessorImpl.invoke0(Native Method)
at sun.reflect.NativeMethodAccessorImpl.invoke(NativeMethodAccessorImpl.java:60)
at sun.reflect.DelegatingMethodAccessorImpl.invoke(DelegatingMethodAccessorImpl.java:37)
at java.lang.reflect.Method.invoke(Method.java:611)
at org.apache.tools.ant.dispatch.DispatchUtils.execute(DispatchUtils.java:106)
at org.apache.tools.ant.Task.perform(Task.java:348)
at net.sf.antcontrib.logic.TryCatchTask.execute(TryCatchTask.java:207)
at org.apache.tools.ant.UnknownElement.execute(UnknownElement.java:288)
at sun.reflect.GeneratedMethodAccessor3.invoke(Unknown Source)
at sun.reflect.DelegatingMethodAccessorImpl.invoke(DelegatingMethodAccessorImpl.java:37)
at java.lang.reflect.Method.invoke(Method.java:611)
at org.apache.tools.ant.dispatch.DispatchUtils.execute(DispatchUtils.java:106)
at org.apache.tools.ant.Task.perform(Task.java:348)
at org.apache.tools.ant.Target.execute(Target.java:357)
at org.apache.tools.ant.Target.performTasks(Target.java:385)
at org.apache.tools.ant.Project.executeSortedTargets(Project.java:1337)
at org.apache.tools.ant.Project.executeTarget(Project.java:1306)
at org.apache.tools.ant.helper.DefaultExecutor.executeTargets(DefaultExecutor.java:41)
at org.apache.tools.ant.Project.executeTargets(Project.java:1189)
at org.apache.tools.ant.Main.runBuild(Main.java:758)
at org.apache.tools.ant.Main.startAnt(Main.java:217)
at org.apache.tools.ant.launch.Launcher.run(Launcher.java:257)
at org.apache.tools.ant.launch.Launcher.main(Launcher.java:104)
Caused by: /wc/wcbd/wcbd-build-common.xml:519: The following error occurred while executing this line:
/wc/wcbd/wcbd-build-common.xml:690: Java returned: 1
at org.apache.tools.ant.ProjectHelper.addLocationToBuildException(ProjectHelper.java:508)
at org.apache.tools.ant.taskdefs.Ant.execute(Ant.java:418)
at org.apache.tools.ant.taskdefs.CallTarget.execute(CallTarget.java:105)
at org.apache.tools.ant.UnknownElement.execute(UnknownElement.java:288)
at sun.reflect.GeneratedMethodAccessor3.invoke(Unknown Source)
at sun.reflect.DelegatingMethodAccessorImpl.invoke(DelegatingMethodAccessorImpl.java:37)
at java.lang.reflect.Method.invoke(Method.java:611)
at org.apache.tools.ant.dispatch.DispatchUtils.execute(DispatchUtils.java:106)
at org.apache.tools.ant.Task.perform(Task.java:348)
at org.apache.tools.ant.taskdefs.Sequential.execute(Sequential.java:62)
at net.sf.antcontrib.logic.IfTask.execute(IfTask.java:197)
at sun.reflect.GeneratedMethodAccessor35.invoke(Unknown Source)
at sun.reflect.DelegatingMethodAccessorImpl.invoke(DelegatingMethodAccessorImpl.java:37)
at java.lang.reflect.Method.invoke(Method.java:611)
at org.apache.tools.ant.dispatch.DispatchUtils.execute(DispatchUtils.java:106)
at org.apache.tools.ant.TaskAdapter.execute(TaskAdapter.java:154)
at org.apache.tools.ant.UnknownElement.execute(UnknownElement.java:288)
at sun.reflect.GeneratedMethodAccessor3.invoke(Unknown Source)
at sun.reflect.DelegatingMethodAccessorImpl.invoke(DelegatingMethodAccessorImpl.java:37)
at java.lang.reflect.Method.invoke(Method.java:611)
at org.apache.tools.ant.dispatch.DispatchUtils.execute(DispatchUtils.java:106)
at org.apache.tools.ant.Task.perform(Task.java:348)
at org.apache.tools.ant.Target.execute(Target.java:357)
at org.apache.tools.ant.Target.performTasks(Target.java:385)
at org.apache.tools.ant.Project.executeSortedTargets(Project.java:1337)
at org.apache.tools.ant.helper.SingleCheckExecutor.executeTargets(SingleCheckExecutor.java:38)
at org.apache.tools.ant.Project.executeTargets(Project.java:1189)
at org.apache.tools.ant.taskdefs.Ant.execute(Ant.java:416)
... 91 more
Caused by: /wc/wcbd/wcbd-build-common.xml:690: Java returned: 1
at org.apache.tools.ant.taskdefs.Java.execute(Java.java:108)
at com.ibm.websphere.ant.tasks.WsEjbDeploy.execute(WsEjbDeploy.java:720)
at org.apache.tools.ant.UnknownElement.execute(UnknownElement.java:288)
at sun.reflect.GeneratedMethodAccessor3.invoke(Unknown Source)
at sun.reflect.DelegatingMethodAccessorImpl.invoke(DelegatingMethodAccessorImpl.java:37)
at java.lang.reflect.Method.invoke(Method.java:611)
at org.apache.tools.ant.dispatch.DispatchUtils.execute(DispatchUtils.java:106)
at org.apache.tools.ant.Task.perform(Task.java:348)
at org.apache.tools.ant.Target.execute(Target.java:357)
at org.apache.tools.ant.Target.performTasks(Target.java:385)
at org.apache.tools.ant.Project.executeSortedTargets(Project.java:1337)
at org.apache.tools.ant.helper.SingleCheckExecutor.executeTargets(SingleCheckExecutor.java:38)
at org.apache.tools.ant.Project.executeTargets(Project.java:1189)
at org.apache.tools.ant.taskdefs.Ant.execute(Ant.java:416)
... 117 more
--- Nested Exception ---
/wc/wcbd/wcbd-build-common.xml:519: The following error occurred while executing this line:
/wc/wcbd/wcbd-build-common.xml:690: Java returned: 1
at org.apache.tools.ant.ProjectHelper.addLocationToBuildException(ProjectHelper.java:508)
at org.apache.tools.ant.taskdefs.Ant.execute(Ant.java:418)
at org.apache.tools.ant.taskdefs.CallTarget.execute(CallTarget.java:105)
at org.apache.tools.ant.UnknownElement.execute(UnknownElement.java:288)
at sun.reflect.GeneratedMethodAccessor3.invoke(Unknown Source)
at sun.reflect.DelegatingMethodAccessorImpl.invoke(DelegatingMethodAccessorImpl.java:37)
at java.lang.reflect.Method.invoke(Method.java:611)
at org.apache.tools.ant.dispatch.DispatchUtils.execute(DispatchUtils.java:106)
at org.apache.tools.ant.Task.perform(Task.java:348)
at org.apache.tools.ant.taskdefs.Sequential.execute(Sequential.java:62)
at net.sf.antcontrib.logic.IfTask.execute(IfTask.java:197)
at sun.reflect.GeneratedMethodAccessor35.invoke(Unknown Source)
at sun.reflect.DelegatingMethodAccessorImpl.invoke(DelegatingMethodAccessorImpl.java:37)
at java.lang.reflect.Method.invoke(Method.java:611)
at org.apache.tools.ant.dispatch.DispatchUtils.execute(DispatchUtils.java:106)
at org.apache.tools.ant.TaskAdapter.execute(TaskAdapter.java:154)
at org.apache.tools.ant.UnknownElement.execute(UnknownElement.java:288)
at sun.reflect.GeneratedMethodAccessor3.invoke(Unknown Source)
at sun.reflect.DelegatingMethodAccessorImpl.invoke(DelegatingMethodAccessorImpl.java:37)
at java.lang.reflect.Method.invoke(Method.java:611)
at org.apache.tools.ant.dispatch.DispatchUtils.execute(DispatchUtils.java:106)
at org.apache.tools.ant.Task.perform(Task.java:348)
at org.apache.tools.ant.Target.execute(Target.java:357)
at org.apache.tools.ant.Target.performTasks(Target.java:385)
at org.apache.tools.ant.Project.executeSortedTargets(Project.java:1337)
at org.apache.tools.ant.helper.SingleCheckExecutor.executeTargets(SingleCheckExecutor.java:38)
at org.apache.tools.ant.Project.executeTargets(Project.java:1189)
at org.apache.tools.ant.taskdefs.Ant.execute(Ant.java:416)
at org.apache.tools.ant.taskdefs.CallTarget.execute(CallTarget.java:105)
at sun.reflect.NativeMethodAccessorImpl.invoke0(Native Method)
at sun.reflect.NativeMethodAccessorImpl.invoke(NativeMethodAccessorImpl.java:60)
at sun.reflect.DelegatingMethodAccessorImpl.invoke(DelegatingMethodAccessorImpl.java:37)
at java.lang.reflect.Method.invoke(Method.java:611)
at org.apache.tools.ant.dispatch.DispatchUtils.execute(DispatchUtils.java:106)
at org.apache.tools.ant.Task.perform(Task.java:348)
at org.apache.tools.ant.taskdefs.Sequential.execute(Sequential.java:62)
at net.sf.antcontrib.logic.ForEach.executeSequential(ForEach.java:178)
at net.sf.antcontrib.logic.ForEach.execute(ForEach.java:254)
at org.apache.tools.ant.UnknownElement.execute(UnknownElement.java:288)
at sun.reflect.GeneratedMethodAccessor3.invoke(Unknown Source)
at sun.reflect.DelegatingMethodAccessorImpl.invoke(DelegatingMethodAccessorImpl.java:37)
at java.lang.reflect.Method.invoke(Method.java:611)
at org.apache.tools.ant.dispatch.DispatchUtils.execute(DispatchUtils.java:106)
at org.apache.tools.ant.Task.perform(Task.java:348)
at org.apache.tools.ant.taskdefs.Sequential.execute(Sequential.java:62)
at net.sf.antcontrib.logic.IfTask.execute(IfTask.java:217)
at sun.reflect.GeneratedMethodAccessor35.invoke(Unknown Source)
at sun.reflect.DelegatingMethodAccessorImpl.invoke(DelegatingMethodAccessorImpl.java:37)
at java.lang.reflect.Method.invoke(Method.java:611)
at org.apache.tools.ant.dispatch.DispatchUtils.execute(DispatchUtils.java:106)
at org.apache.tools.ant.TaskAdapter.execute(TaskAdapter.java:154)
at org.apache.tools.ant.UnknownElement.execute(UnknownElement.java:288)
at sun.reflect.GeneratedMethodAccessor3.invoke(Unknown Source)
at sun.reflect.DelegatingMethodAccessorImpl.invoke(DelegatingMethodAccessorImpl.java:37)
at java.lang.reflect.Method.invoke(Method.java:611)
at org.apache.tools.ant.dispatch.DispatchUtils.execute(DispatchUtils.java:106)
at org.apache.tools.ant.Task.perform(Task.java:348)
at org.apache.tools.ant.Target.execute(Target.java:357)
at org.apache.tools.ant.Target.performTasks(Target.java:385)
at org.apache.tools.ant.Project.executeSortedTargets(Project.java:1337)
at org.apache.tools.ant.helper.SingleCheckExecutor.executeTargets(SingleCheckExecutor.java:38)
at org.apache.tools.ant.Project.executeTargets(Project.java:1189)
at org.apache.tools.ant.taskdefs.Ant.execute(Ant.java:416)
at org.apache.tools.ant.taskdefs.CallTarget.execute(CallTarget.java:105)
at org.apache.tools.ant.UnknownElement.execute(UnknownElement.java:288)
at sun.reflect.GeneratedMethodAccessor3.invoke(Unknown Source)
at sun.reflect.DelegatingMethodAccessorImpl.invoke(DelegatingMethodAccessorImpl.java:37)
at java.lang.reflect.Method.invoke(Method.java:611)
at org.apache.tools.ant.dispatch.DispatchUtils.execute(DispatchUtils.java:106)
at org.apache.tools.ant.Task.perform(Task.java:348)
at org.apache.tools.ant.Target.execute(Target.java:357)
at org.apache.tools.ant.Target.performTasks(Target.java:385)
at org.apache.tools.ant.Project.executeSortedTargets(Project.java:1337)
at org.apache.tools.ant.helper.SingleCheckExecutor.executeTargets(SingleCheckExecutor.java:38)
at org.apache.tools.ant.Project.executeTargets(Project.java:1189)
at org.apache.tools.ant.taskdefs.Ant.execute(Ant.java:416)
at org.apache.tools.ant.taskdefs.CallTarget.execute(CallTarget.java:105)
at org.apache.tools.ant.UnknownElement.execute(UnknownElement.java:288)
at sun.reflect.GeneratedMethodAccessor3.invoke(Unknown Source)
at sun.reflect.DelegatingMethodAccessorImpl.invoke(DelegatingMethodAccessorImpl.java:37)
at java.lang.reflect.Method.invoke(Method.java:611)
at org.apache.tools.ant.dispatch.DispatchUtils.execute(DispatchUtils.java:106)
at org.apache.tools.ant.Task.perform(Task.java:348)
at org.apache.tools.ant.Target.execute(Target.java:357)
at org.apache.tools.ant.Target.performTasks(Target.java:385)
at org.apache.tools.ant.Project.executeSortedTargets(Project.java:1337)
at org.apache.tools.ant.helper.SingleCheckExecutor.executeTargets(SingleCheckExecutor.java:38)
at org.apache.tools.ant.Project.executeTargets(Project.java:1189)
at org.apache.tools.ant.taskdefs.Ant.execute(Ant.java:416)
at org.apache.tools.ant.UnknownElement.execute(UnknownElement.java:288)
at sun.reflect.GeneratedMethodAccessor3.invoke(Unknown Source)
at sun.reflect.DelegatingMethodAccessorImpl.invoke(DelegatingMethodAccessorImpl.java:37)
at java.lang.reflect.Method.invoke(Method.java:611)
at org.apache.tools.ant.dispatch.DispatchUtils.execute(DispatchUtils.java:106)
at org.apache.tools.ant.Task.perform(Task.java:348)
at org.apache.tools.ant.taskdefs.Sequential.execute(Sequential.java:62)
at sun.reflect.NativeMethodAccessorImpl.invoke0(Native Method)
at sun.reflect.NativeMethodAccessorImpl.invoke(NativeMethodAccessorImpl.java:60)
at sun.reflect.DelegatingMethodAccessorImpl.invoke(DelegatingMethodAccessorImpl.java:37)
at java.lang.reflect.Method.invoke(Method.java:611)
at org.apache.tools.ant.dispatch.DispatchUtils.execute(DispatchUtils.java:106)
at org.apache.tools.ant.Task.perform(Task.java:348)
at net.sf.antcontrib.logic.TryCatchTask.execute(TryCatchTask.java:207)
at org.apache.tools.ant.UnknownElement.execute(UnknownElement.java:288)
at sun.reflect.GeneratedMethodAccessor3.invoke(Unknown Source)
at sun.reflect.DelegatingMethodAccessorImpl.invoke(DelegatingMethodAccessorImpl.java:37)
at java.lang.reflect.Method.invoke(Method.java:611)
at org.apache.tools.ant.dispatch.DispatchUtils.execute(DispatchUtils.java:106)
at org.apache.tools.ant.Task.perform(Task.java:348)
at org.apache.tools.ant.Target.execute(Target.java:357)
at org.apache.tools.ant.Target.performTasks(Target.java:385)
at org.apache.tools.ant.Project.executeSortedTargets(Project.java:1337)
at org.apache.tools.ant.Project.executeTarget(Project.java:1306)
at org.apache.tools.ant.helper.DefaultExecutor.executeTargets(DefaultExecutor.java:41)
at org.apache.tools.ant.Project.executeTargets(Project.java:1189)
at org.apache.tools.ant.Main.runBuild(Main.java:758)
at org.apache.tools.ant.Main.startAnt(Main.java:217)
at org.apache.tools.ant.launch.Launcher.run(Launcher.java:257)
at org.apache.tools.ant.launch.Launcher.main(Launcher.java:104)
Caused by: /wc/wcbd/wcbd-build-common.xml:690: Java returned: 1
at org.apache.tools.ant.taskdefs.Java.execute(Java.java:108)
at com.ibm.websphere.ant.tasks.WsEjbDeploy.execute(WsEjbDeploy.java:720)
at org.apache.tools.ant.UnknownElement.execute(UnknownElement.java:288)
at sun.reflect.GeneratedMethodAccessor3.invoke(Unknown Source)
at sun.reflect.DelegatingMethodAccessorImpl.invoke(DelegatingMethodAccessorImpl.java:37)
at java.lang.reflect.Method.invoke(Method.java:611)
at org.apache.tools.ant.dispatch.DispatchUtils.execute(DispatchUtils.java:106)
at org.apache.tools.ant.Task.perform(Task.java:348)
at org.apache.tools.ant.Target.execute(Target.java:357)
at org.apache.tools.ant.Target.performTasks(Target.java:385)
at org.apache.tools.ant.Project.executeSortedTargets(Project.java:1337)
at org.apache.tools.ant.helper.SingleCheckExecutor.executeTargets(SingleCheckExecutor.java:38)
at org.apache.tools.ant.Project.executeTargets(Project.java:1189)
at org.apache.tools.ant.taskdefs.Ant.execute(Ant.java:416)
... 117 more
--- Nested Exception ---
/wc/wcbd/wcbd-build-common.xml:690: Java returned: 1
at org.apache.tools.ant.taskdefs.Java.execute(Java.java:108)
at com.ibm.websphere.ant.tasks.WsEjbDeploy.execute(WsEjbDeploy.java:720)
at org.apache.tools.ant.UnknownElement.execute(UnknownElement.java:288)
at sun.reflect.GeneratedMethodAccessor3.invoke(Unknown Source)
at sun.reflect.DelegatingMethodAccessorImpl.invoke(DelegatingMethodAccessorImpl.java:37)
at java.lang.reflect.Method.invoke(Method.java:611)
at org.apache.tools.ant.dispatch.DispatchUtils.execute(DispatchUtils.java:106)
at org.apache.tools.ant.Task.perform(Task.java:348)
at org.apache.tools.ant.Target.execute(Target.java:357)
at org.apache.tools.ant.Target.performTasks(Target.java:385)
at org.apache.tools.ant.Project.executeSortedTargets(Project.java:1337)
at org.apache.tools.ant.helper.SingleCheckExecutor.executeTargets(SingleCheckExecutor.java:38)
at org.apache.tools.ant.Project.executeTargets(Project.java:1189)
at org.apache.tools.ant.taskdefs.Ant.execute(Ant.java:416)
at org.apache.tools.ant.taskdefs.CallTarget.execute(CallTarget.java:105)
at org.apache.tools.ant.UnknownElement.execute(UnknownElement.java:288)
at sun.reflect.GeneratedMethodAccessor3.invoke(Unknown Source)
at sun.reflect.DelegatingMethodAccessorImpl.invoke(DelegatingMethodAccessorImpl.java:37)
at java.lang.reflect.Method.invoke(Method.java:611)
at org.apache.tools.ant.dispatch.DispatchUtils.execute(DispatchUtils.java:106)
at org.apache.tools.ant.Task.perform(Task.java:348)
at org.apache.tools.ant.taskdefs.Sequential.execute(Sequential.java:62)
at net.sf.antcontrib.logic.IfTask.execute(IfTask.java:197)
at sun.reflect.GeneratedMethodAccessor35.invoke(Unknown Source)
at sun.reflect.DelegatingMethodAccessorImpl.invoke(DelegatingMethodAccessorImpl.java:37)
at java.lang.reflect.Method.invoke(Method.java:611)
at org.apache.tools.ant.dispatch.DispatchUtils.execute(DispatchUtils.java:106)
at org.apache.tools.ant.TaskAdapter.execute(TaskAdapter.java:154)
at org.apache.tools.ant.UnknownElement.execute(UnknownElement.java:288)
at sun.reflect.GeneratedMethodAccessor3.invoke(Unknown Source)
at sun.reflect.DelegatingMethodAccessorImpl.invoke(DelegatingMethodAccessorImpl.java:37)
at java.lang.reflect.Method.invoke(Method.java:611)
at org.apache.tools.ant.dispatch.DispatchUtils.execute(DispatchUtils.java:106)
at org.apache.tools.ant.Task.perform(Task.java:348)
at org.apache.tools.ant.Target.execute(Target.java:357)
at org.apache.tools.ant.Target.performTasks(Target.java:385)
at org.apache.tools.ant.Project.executeSortedTargets(Project.java:1337)
at org.apache.tools.ant.helper.SingleCheckExecutor.executeTargets(SingleCheckExecutor.java:38)
at org.apache.tools.ant.Project.executeTargets(Project.java:1189)
at org.apache.tools.ant.taskdefs.Ant.execute(Ant.java:416)
at org.apache.tools.ant.taskdefs.CallTarget.execute(CallTarget.java:105)
at sun.reflect.NativeMethodAccessorImpl.invoke0(Native Method)
at sun.reflect.NativeMethodAccessorImpl.invoke(NativeMethodAccessorImpl.java:60)
at sun.reflect.DelegatingMethodAccessorImpl.invoke(DelegatingMethodAccessorImpl.java:37)
at java.lang.reflect.Method.invoke(Method.java:611)
at org.apache.tools.ant.dispatch.DispatchUtils.execute(DispatchUtils.java:106)
at org.apache.tools.ant.Task.perform(Task.java:348)
at org.apache.tools.ant.taskdefs.Sequential.execute(Sequential.java:62)
at net.sf.antcontrib.logic.ForEach.executeSequential(ForEach.java:178)
at net.sf.antcontrib.logic.ForEach.execute(ForEach.java:254)
at org.apache.tools.ant.UnknownElement.execute(UnknownElement.java:288)
at sun.reflect.GeneratedMethodAccessor3.invoke(Unknown Source)
at sun.reflect.DelegatingMethodAccessorImpl.invoke(DelegatingMethodAccessorImpl.java:37)
at java.lang.reflect.Method.invoke(Method.java:611)
at org.apache.tools.ant.dispatch.DispatchUtils.execute(DispatchUtils.java:106)
at org.apache.tools.ant.Task.perform(Task.java:348)
at org.apache.tools.ant.taskdefs.Sequential.execute(Sequential.java:62)
at net.sf.antcontrib.logic.IfTask.execute(IfTask.java:217)
at sun.reflect.GeneratedMethodAccessor35.invoke(Unknown Source)
at sun.reflect.DelegatingMethodAccessorImpl.invoke(DelegatingMethodAccessorImpl.java:37)
at java.lang.reflect.Method.invoke(Method.java:611)
at org.apache.tools.ant.dispatch.DispatchUtils.execute(DispatchUtils.java:106)
at org.apache.tools.ant.TaskAdapter.execute(TaskAdapter.java:154)
at org.apache.tools.ant.UnknownElement.execute(UnknownElement.java:288)
at sun.reflect.GeneratedMethodAccessor3.invoke(Unknown Source)
at sun.reflect.DelegatingMethodAccessorImpl.invoke(DelegatingMethodAccessorImpl.java:37)
at java.lang.reflect.Method.invoke(Method.java:611)
at org.apache.tools.ant.dispatch.DispatchUtils.execute(DispatchUtils.java:106)
at org.apache.tools.ant.Task.perform(Task.java:348)
at org.apache.tools.ant.Target.execute(Target.java:357)
at org.apache.tools.ant.Target.performTasks(Target.java:385)
at org.apache.tools.ant.Project.executeSortedTargets(Project.java:1337)
at org.apache.tools.ant.helper.SingleCheckExecutor.executeTargets(SingleCheckExecutor.java:38)
at org.apache.tools.ant.Project.executeTargets(Project.java:1189)
at org.apache.tools.ant.taskdefs.Ant.execute(Ant.java:416)
at org.apache.tools.ant.taskdefs.CallTarget.execute(CallTarget.java:105)
at org.apache.tools.ant.UnknownElement.execute(UnknownElement.java:288)
at sun.reflect.GeneratedMethodAccessor3.invoke(Unknown Source)
at sun.reflect.DelegatingMethodAccessorImpl.invoke(DelegatingMethodAccessorImpl.java:37)
at java.lang.reflect.Method.invoke(Method.java:611)
at org.apache.tools.ant.dispatch.DispatchUtils.execute(DispatchUtils.java:106)
at org.apache.tools.ant.Task.perform(Task.java:348)
at org.apache.tools.ant.Target.execute(Target.java:357)
at org.apache.tools.ant.Target.performTasks(Target.java:385)
at org.apache.tools.ant.Project.executeSortedTargets(Project.java:1337)
at org.apache.tools.ant.helper.SingleCheckExecutor.executeTargets(SingleCheckExecutor.java:38)
at org.apache.tools.ant.Project.executeTargets(Project.java:1189)
at org.apache.tools.ant.taskdefs.Ant.execute(Ant.java:416)
at org.apache.tools.ant.taskdefs.CallTarget.execute(CallTarget.java:105)
at org.apache.tools.ant.UnknownElement.execute(UnknownElement.java:288)
at sun.reflect.GeneratedMethodAccessor3.invoke(Unknown Source)
at sun.reflect.DelegatingMethodAccessorImpl.invoke(DelegatingMethodAccessorImpl.java:37)
at java.lang.reflect.Method.invoke(Method.java:611)
at org.apache.tools.ant.dispatch.DispatchUtils.execute(DispatchUtils.java:106)
at org.apache.tools.ant.Task.perform(Task.java:348)
at org.apache.tools.ant.Target.execute(Target.java:357)
at org.apache.tools.ant.Target.performTasks(Target.java:385)
at org.apache.tools.ant.Project.executeSortedTargets(Project.java:1337)
at org.apache.tools.ant.helper.SingleCheckExecutor.executeTargets(SingleCheckExecutor.java:38)
at org.apache.tools.ant.Project.executeTargets(Project.java:1189)
at org.apache.tools.ant.taskdefs.Ant.execute(Ant.java:416)
at org.apache.tools.ant.UnknownElement.execute(UnknownElement.java:288)
at sun.reflect.GeneratedMethodAccessor3.invoke(Unknown Source)
at sun.reflect.DelegatingMethodAccessorImpl.invoke(DelegatingMethodAccessorImpl.java:37)
at java.lang.reflect.Method.invoke(Method.java:611)
at org.apache.tools.ant.dispatch.DispatchUtils.execute(DispatchUtils.java:106)
at org.apache.tools.ant.Task.perform(Task.java:348)
at org.apache.tools.ant.taskdefs.Sequential.execute(Sequential.java:62)
at sun.reflect.NativeMethodAccessorImpl.invoke0(Native Method)
at sun.reflect.NativeMethodAccessorImpl.invoke(NativeMethodAccessorImpl.java:60)
at sun.reflect.DelegatingMethodAccessorImpl.invoke(DelegatingMethodAccessorImpl.java:37)
at java.lang.reflect.Method.invoke(Method.java:611)
at org.apache.tools.ant.dispatch.DispatchUtils.execute(DispatchUtils.java:106)
at org.apache.tools.ant.Task.perform(Task.java:348)
at net.sf.antcontrib.logic.TryCatchTask.execute(TryCatchTask.java:207)
at org.apache.tools.ant.UnknownElement.execute(UnknownElement.java:288)
at sun.reflect.GeneratedMethodAccessor3.invoke(Unknown Source)
at sun.reflect.DelegatingMethodAccessorImpl.invoke(DelegatingMethodAccessorImpl.java:37)
at java.lang.reflect.Method.invoke(Method.java:611)
at org.apache.tools.ant.dispatch.DispatchUtils.execute(DispatchUtils.java:106)
at org.apache.tools.ant.Task.perform(Task.java:348)
at org.apache.tools.ant.Target.execute(Target.java:357)
at org.apache.tools.ant.Target.performTasks(Target.java:385)
at org.apache.tools.ant.Project.executeSortedTargets(Project.java:1337)
at org.apache.tools.ant.Project.executeTarget(Project.java:1306)
at org.apache.tools.ant.helper.DefaultExecutor.executeTargets(DefaultExecutor.java:41)
at org.apache.tools.ant.Project.executeTargets(Project.java:1189)
at org.apache.tools.ant.Main.runBuild(Main.java:758)
at org.apache.tools.ant.Main.startAnt(Main.java:217)
at org.apache.tools.ant.launch.Launcher.run(Launcher.java:257)
at org.apache.tools.ant.launch.Launcher.main(Launcher.java:104)
Setting project property: deploy.server.dir -> /wc/wcbd/deploy/server
Setting project property: sun.java2d.fontpath -> 
Setting project property: open.laszlo.web.src.dir -> src
Setting project property: ext.compile.class.path -> 
Setting project property: java.specification.version -> 1.6
Setting project property: mail.failure.subject -> WCBD Build FAILED: 2018-08-29-MRF17APR-3_B1.0
Setting project property: log.file -> /wc/wcbd/logs/2018-08-29-MRF17APR-3_B1.0-20180829125332/wcbd-build.log
Setting project property: extract.update.mode -> false
Setting project property: tstamp -> 20180829125332
Setting project property: connector.module.list -> 
Setting project property: dos2unix.includes -> setenv,wcbd-ant,wcbd-encode-properties,wcbd-setenv.template,**/*.xml,**/*.xmi,**/*.properties
Setting project property: java.class.path -> /opt/apache-ant-1.7.1/lib/ant-launcher.jar:/opt/IBM/WebSphere/CommerceServer70/lib/:/opt/IBM/WebSphere/AppServer/plugins/com.ibm.ws.runtime.jar:/opt/IBM/WebSphere/AppServer/lib/:/wc/wcbd/lib/commons-lang-2.4.jar:/wc/wcbd/lib/svnjavahl.jar:/wc/wcbd/lib/svnClientAdapter.jar:/wc/wcbd/lib/svnant.jar:/wc/wcbd/lib/org.eclipse.emf.ecore.xmi.jar:/wc/wcbd/lib/org.eclipse.emf.ecore.jar:/wc/wcbd/lib/org.eclipse.emf.common.jar:/wc/wcbd/lib/org.eclipse.core.runtime_.jar:/wc/wcbd/lib/com.ibm.ws.emf.jar:/wc/wcbd/lib/bootstrap.jar:/wc/wcbd/lib/runtime.jar:/wc/wcbd/lib/com.ibm.ws.wccm.jar:/wc/wcbd/lib/wssec.jar:/wc/wcbd/lib/wcbd.jar:/wc/wcbd/lib/mail.jar:/wc/wcbd/lib/jsch-0.1.42.jar:/wc/wcbd/lib/jakarta-oro-2.0.8.jar:/wc/wcbd/lib/commons-net-1.4.1.jar:/wc/wcbd/lib/ant-contrib-1.0b3.jar:/wc/wcbd/lib/activation.jar:/home/wcuser/java/lib/jt400.jar:/home/wcuser/java/lib/jt400.jar:/home/db2inst1/sqllib/java/db2java.zip:/home/db2inst1/sqllib/function/:/home/db2inst1/sqllib/java/db2jcc_license_cu.jar:/home/db2inst1/sqllib/tools/clpplus.jar:/home/db2inst1/sqllib/tools/antlr-3.2.jar:/home/db2inst1/sqllib/tools/jline-0.9.93.jar:/home/db2inst1/sqllib/java/db2jcc.jar:/wc/wcbd/./:/opt/apache-ant-1.7.1/lib/ant-apache-bsf.jar:/opt/apache-ant-1.7.1/lib/ant-javamail.jar:/opt/apache-ant-1.7.1/lib/xml-apis.jar:/opt/apache-ant-1.7.1/lib/j2ssh-ant-0.2.2.jar:/opt/apache-ant-1.7.1/lib/AntelopeTasks_3.4.2.jar:/opt/apache-ant-1.7.1/lib/ant-jmf.jar:/opt/apache-ant-1.7.1/lib/ant-testutil.jar:/opt/apache-ant-1.7.1/lib/ant-commons-logging.jar:/opt/apache-ant-1.7.1/lib/resolver.jar:/opt/apache-ant-1.7.1/lib/j2ssh-core-0.2.2.jar:/opt/apache-ant-1.7.1/lib/ant-starteam.jar:/opt/apache-ant-1.7.1/lib/commons-httpclient-3.1.jar:/opt/apache-ant-1.7.1/lib/cpptasks.jar:/opt/apache-ant-1.7.1/lib/antelopetasks-3.2.10.jar:/opt/apache-ant-1.7.1/lib/ant-stylebook.jar:/opt/apache-ant-1.7.1/lib/org.eclipse.wst.wsi_1.0.205.v200805140300.jar:/opt/apache-ant-1.7.1/lib/j2ssh-ant-0.2.9.jar:/opt/apache-ant-1.7.1/lib/wsdl4j.jar:/opt/apache-ant-1.7.1/lib/ant-apache-log4j.jar:/opt/apache-ant-1.7.1/lib/j2ssh-common-0.2.9.jar:/opt/apache-ant-1.7.1/lib/ant-nodeps.jar:/opt/apache-ant-1.7.1/lib/ant-netrexx.jar:/opt/apache-ant-1.7.1/lib/ant-jai.jar:/opt/apache-ant-1.7.1/lib/xercesImpl.jar:/opt/apache-ant-1.7.1/lib/ant-apache-resolver.jar:/opt/apache-ant-1.7.1/lib/ant-commons-net.jar:/opt/apache-ant-1.7.1/lib/ant-weblogic.jar:/opt/apache-ant-1.7.1/lib/ant-apache-oro.jar:/opt/apache-ant-1.7.1/lib/ant-swing.jar:/opt/apache-ant-1.7.1/lib/ant-launcher.jar:/opt/apache-ant-1.7.1/lib/ant-apache-regexp.jar:/opt/apache-ant-1.7.1/lib/qname.jar:/opt/apache-ant-1.7.1/lib/ant-antlr.jar:/opt/apache-ant-1.7.1/lib/j2ssh-core-0.2.9.jar:/opt/apache-ant-1.7.1/lib/ant.jar:/opt/apache-ant-1.7.1/lib/ant-trax.jar:/opt/apache-ant-1.7.1/lib/ant-jsch.jar:/opt/apache-ant-1.7.1/lib/j2ssh-daemon-0.2.9.jar:/opt/apache-ant-1.7.1/lib/ant-apache-bcel.jar:/opt/apache-ant-1.7.1/lib/org.eclipse.wst.wsdl.validation_1.1.302.v200807240215.jar:/opt/apache-ant-1.7.1/lib/ant-jdepend.jar:/opt/apache-ant-1.7.1/lib/ant-junit.jar:/opt/IBM/WebSphere/AppServer/java/lib/tools.jar
Setting project property: java.class.version -> 50.0
Setting project property: run.dos2unix -> true
Setting project property: java.module.list -> WebSphereCommerceServerExtensionsLogic,sampleIncMemberServicesDataObjects
Setting project property: com.ibm.oti.shared.enabled -> false
Setting project property: TODAY -> August 29 2018
Setting project property: ejbdeploy.keep.generated -> true
Setting project property: working.archive.dir -> /wc/wcbd/working/archive
Setting project property: connector.src.dir -> connectorModule
Setting project property: sun.java.launcher -> SUN_STANDARD
Setting project property: java.version -> 1.6.0
Setting project property: user.install.root -> /opt/IBM/WebSphere/AppServer
Setting project property: ibm.signalhandling.sigint -> true
Setting project property: was.ant.extra.classpath -> /opt/IBM/WebSphere/AppServer/optionalLibraries/jython/jython.jar
Setting project property: os.version -> 2.6.18-402.el5
Setting project property: java.assistive -> ON
Setting project property: user.country -> US
Setting project property: deploy.toolkit.dir -> /wc/wcbd/deploy/toolkit
Setting project property: files -> /wc/wcbd/logs/2018-08-29-MRF17APR-3_B1.0-20180829125332/wcbd-build-log-2018-08-29-MRF17APR-3_B1.0.zip
Setting project property: com.ibm.oti.vm.library.version -> 24
Setting project property: mail.success.subject -> WCBD Build Successful: 2018-08-29-MRF17APR-3_B1.0
Setting project property: java.bin.dir -> bin
Setting project property: file.encoding -> UTF-8
Setting project property: deploy.server.command -> wcbd-ant
Setting project property: wc.home -> /opt/IBM/WebSphere/CommerceServer70
Setting project property: com.ibm.jcl.checkClassPath -> 
Setting project property: user.variant -> 
Setting project property: ejbdeploy.jvm.max.memory -> 512M
Setting project property: java.io.tmpdir -> /tmp
Setting project property: sun.boot.class.path -> /opt/IBM/WebSphere/AppServer/java/jre/lib/amd64/default/jclSC160/vm.jar:/opt/IBM/WebSphere/AppServer/java/jre/lib/annotation.jar:/opt/IBM/WebSphere/AppServer/java/jre/lib/beans.jar:/opt/IBM/WebSphere/AppServer/java/jre/lib/java.util.jar:/opt/IBM/WebSphere/AppServer/java/jre/lib/jndi.jar:/opt/IBM/WebSphere/AppServer/java/jre/lib/logging.jar:/opt/IBM/WebSphere/AppServer/java/jre/lib/security.jar:/opt/IBM/WebSphere/AppServer/java/jre/lib/sql.jar:/opt/IBM/WebSphere/AppServer/java/jre/lib/ibmorb.jar:/opt/IBM/WebSphere/AppServer/java/jre/lib/ibmorbapi.jar:/opt/IBM/WebSphere/AppServer/java/jre/lib/ibmcfw.jar:/opt/IBM/WebSphere/AppServer/java/jre/lib/rt.jar:/opt/IBM/WebSphere/AppServer/java/jre/lib/charsets.jar:/opt/IBM/WebSphere/AppServer/java/jre/lib/resources.jar:/opt/IBM/WebSphere/AppServer/java/jre/lib/ibmpkcs.jar:/opt/IBM/WebSphere/AppServer/java/jre/lib/ibmcertpathfw.jar:/opt/IBM/WebSphere/AppServer/java/jre/lib/ibmjgssfw.jar:/opt/IBM/WebSphere/AppServer/java/jre/lib/ibmjssefw.jar:/opt/IBM/WebSphere/AppServer/java/jre/lib/ibmsaslfw.jar:/opt/IBM/WebSphere/AppServer/java/jre/lib/ibmjcefw.jar:/opt/IBM/WebSphere/AppServer/java/jre/lib/ibmjgssprovider.jar:/opt/IBM/WebSphere/AppServer/java/jre/lib/ibmjsseprovider2.jar:/opt/IBM/WebSphere/AppServer/java/jre/lib/ibmcertpathprovider.jar:/opt/IBM/WebSphere/AppServer/java/jre/lib/management-agent.jar:/opt/IBM/WebSphere/AppServer/java/jre/lib/xml.jar:/opt/IBM/WebSphere/AppServer/java/jre/lib/jlm.jar:/opt/IBM/WebSphere/AppServer/java/jre/lib/javascript.jar
Setting project property: java.vendor -> IBM Corporation
Setting project property: java.vm.vendor -> IBM Corporation
Setting project property: mail.mailhost -> smtp.sampleinc.com
Setting project property: working.package.toolkit.dir -> /wc/wcbd/working/package/toolkit
Setting project property: deploy.server.workspace.dir -> /wc/wcbd/deploy-server-workspace
Setting project property: extract.ant.file -> extract-svn.xml
Setting project property: web.content.dir -> WebContent
Setting project property: mail.success.tolist -> john.kinder@sampleglobal.com
Setting project property: user.timezone -> 
Setting project property: line.separator -> 
Setting project property: user.dir -> /wc/wcbd
Setting project property: dos2unix.excludes -> **/*.ear,**/*.jar,**/*.rar,**/*.war,**/*.zip
Setting project property: static.web.module.name -> StaticWeb
Setting project property: web.module.list -> Stores,WebServicesRouter
Setting project property: path.separator -> :
Setting project property: run.package.toolkit -> false
Setting project property: java.vm.specification.version -> 1.0
Setting project property: mail.success.message -> Build successful!
Setting project property: ant.version -> Apache Ant version 1.7.1 compiled on June 27 2008
Setting project property: throwable.msg -> The following error occurred while executing this line:
/wc/wcbd/wcbd-build.xml:175: The following error occurred while executing this line:
/wc/wcbd/wcbd-build-common.xml:396: The following error occurred while executing this line:
/wc/wcbd/wcbd-build-common.xml:476: The following error occurred while executing this line:
/wc/wcbd/wcbd-build-common.xml:519: The following error occurred while executing this line:
/wc/wcbd/wcbd-build-common.xml:690: Java returned: 1
Setting project property: unit.test.lib.dir -> /wc/wcbd/ut-lib
Setting project property: os.name -> Linux
Setting project property: build.type.suffix -> 
Setting project property: db.type -> db2
Setting project property: java.awt.fonts -> 
Setting project property: data.module.name -> DataLoad
Setting project property: ejbdeploy.no.validate -> true
Setting project property: sun.io.unicode.encoding -> UnicodeLittle
Setting project property: open.laszlo.web.bin.dir -> WebContent/WEB-INF/classes
Setting project property: ejb.src.dir -> ejbModule
Setting project property: sun.java.command -> org.apache.tools.ant.launch.Launcher -cp /opt/IBM/WebSphere/CommerceServer70/lib:/opt/IBM/WebSphere/AppServer/plugins/com.ibm.ws.runtime.jar:/opt/IBM/WebSphere/AppServer/lib:/wc/wcbd/lib/commons-lang-2.4.jar:/wc/wcbd/lib/svnjavahl.jar:/wc/wcbd/lib/svnClientAdapter.jar:/wc/wcbd/lib/svnant.jar:/wc/wcbd/lib/org.eclipse.emf.ecore.xmi.jar:/wc/wcbd/lib/org.eclipse.emf.ecore.jar:/wc/wcbd/lib/org.eclipse.emf.common.jar:/wc/wcbd/lib/org.eclipse.core.runtime_.jar:/wc/wcbd/lib/com.ibm.ws.emf.jar:/wc/wcbd/lib/bootstrap.jar:/wc/wcbd/lib/runtime.jar:/wc/wcbd/lib/com.ibm.ws.wccm.jar:/wc/wcbd/lib/wssec.jar:/wc/wcbd/lib/wcbd.jar:/wc/wcbd/lib/mail.jar:/wc/wcbd/lib/jsch-0.1.42.jar:/wc/wcbd/lib/jakarta-oro-2.0.8.jar:/wc/wcbd/lib/commons-net-1.4.1.jar:/wc/wcbd/lib/ant-contrib-1.0b3.jar:/wc/wcbd/lib/activation.jar:/home/wcuser/java/lib/jt400.jar:/home/wcuser/java/lib/jt400.jar:/home/db2inst1/sqllib/java/db2java.zip:/home/db2inst1/sqllib/function:/home/db2inst1/sqllib/java/db2jcc_license_cu.jar:/home/db2inst1/sqllib/tools/clpplus.jar:/home/db2inst1/sqllib/tools/antlr-3.2.jar:/home/db2inst1/sqllib/tools/jline-0.9.93.jar:/home/db2inst1/sqllib/java/db2jcc.jar:. -d -buildfile wcbd-build.xml -Dbuild.label=2018-08-29-MRF17APR-3_B1.0
Setting project property: com.ibm.oti.configuration -> scar
Setting project property: file.separator -> /
Setting project property: mail.failure.tolist -> john.kinder@sampleglobal.com
Setting project property: jxe.current.romimage.version -> 15
Setting project property: connector.bin.dir -> connectorModule
Setting project property: java.fullversion -> JRE 1.6.0 IBM J9 2.4 Linux amd64-64 jvmxa6460sr16fp20-20151221_282799 (JIT enabled, AOT enabled)
J9VM - 20151221_282799
JIT  - r9_20151217_107718
GC   - GA24_Java6_SR16_20151221_0938_B282799
Setting project property: dist.dir -> /wc/wcbd/dist
Setting project property: mail.mailport -> 25
Setting project property: java.ext.dirs -> /opt/IBM/WebSphere/AppServer/java/jre/lib/ext
Setting project property: ant.home -> /opt/apache-ant-1.7.1
Setting project property: module.dir -> /wc/wcbd/source/2018-08-29-MRF17APR-3_B1.0/workspace
Setting project property: dist.server.dir -> /wc/wcbd/dist/server
Setting project property: sun.boot.library.path -> /opt/IBM/WebSphere/AppServer/java/jre/lib/amd64/default:/opt/IBM/WebSphere/AppServer/java/jre/lib/amd64
Setting project property: product.file.str -> <?xml version="1.0" encoding="UTF-8"?>
<!DOCTYPE product PUBLIC "productId" "dtd/product.dtd">
<product name="IBM WebSphere Commerce">
  <id>wc.server.be</id>
  <version>7.0.0.6</version>
  <build-info date="17/06/12" level="120617sup"/>
</product>
Setting project property: jxe.lowest.romimage.version -> 15
Setting project property: com.ibm.cpu.endian -> little
Setting project property: mail.password -> 
Setting project property: ejbdeploy.codegen -> false
Setting project property: sun.jnu.encoding -> UTF-8
Setting project property: ibm.signalhandling.sigchain -> true
Setting project property: deploy.server.command.args -> -buildfile wcbd-deploy.xml
Setting project property: ejbdeploy.trace -> true
Setting project property: working.package.server.dir -> /wc/wcbd/working/package/server
Setting project property: ejb.module.list -> WebSphereCommerceServerExtensionsData
Setting project property: build.type.prefix -> 
Setting project property: ant.library.dir -> /opt/apache-ant-1.7.1/lib
Setting project property: os.encoding -> UTF-8
Setting project property: working.dir -> /wc/wcbd/working
Setting project property: mail.ssl -> false
Project base dir set to: /wc/wcbd
Setting ro project property: tolist -> john.kinder@sampleglobal.com
Setting ro project property: message -> Check attached logs for details.
Setting ro project property: subject -> WCBD Build FAILED: 2018-08-29-MRF17APR-3_B1.0
Setting ro project property: files -> /wc/wcbd/logs/2018-08-29-MRF17APR-3_B1.0-20180829125332/wcbd-build-log-2018-08-29-MRF17APR-3_B1.0.zip
  [antcall] calling target(s) [mail] in build file /wc/wcbd/wcbd-build.xml
Setting ro project property: ant.file -> /wc/wcbd/wcbd-build.xml
Adding reference: ant.projectHelper
Adding reference: ant.parsing.context
Adding reference: ant.targets
parsing buildfile /wc/wcbd/wcbd-build.xml with URI = file:/wc/wcbd/wcbd-build.xml
Setting ro project property: ant.project.name -> wcbd-build
Adding reference: wcbd-build
Setting ro project property: ant.file.wcbd-build -> /wc/wcbd/wcbd-build.xml
Project base dir set to: /wc/wcbd
 +Target: 
 +Target: all
 +Target: build
Override ignored for property "tstamp"
Override ignored for property "DSTAMP"
Override ignored for property "TSTAMP"
Override ignored for property "TODAY"
 [property] Loading /wc/wcbd/wcbd-version-info.properties
Override ignored for property "wcbd.version"
Adding reference: init.wcbd.ant.class.path
Finding class com.ibm.commerce.wcbd.ant.taskdefs.FailNL
Loaded from /wc/wcbd/lib/wcbd-ant.jar com/ibm/commerce/wcbd/ant/taskdefs/FailNL.class
Class org.apache.tools.ant.Task loaded from parent loader (parentFirst)
Class com.ibm.commerce.wcbd.ant.taskdefs.FailNL loaded from ant loader (parentFirst)
Class java.util.List loaded from parent loader (parentFirst)
Class java.lang.Throwable loaded from parent loader (parentFirst)
Class org.apache.tools.ant.BuildException loaded from parent loader (parentFirst)
Class org.apache.tools.ant.taskdefs.condition.ConditionBase loaded from parent loader (parentFirst)
Finding class com.ibm.commerce.wcbd.ant.taskdefs.FailNL$NestedCondition
Loaded from /wc/wcbd/lib/wcbd-ant.jar com/ibm/commerce/wcbd/ant/taskdefs/FailNL$NestedCondition.class
Class org.apache.tools.ant.taskdefs.condition.Condition loaded from parent loader (parentFirst)
Class com.ibm.commerce.wcbd.ant.taskdefs.FailNL$NestedCondition loaded from ant loader (parentFirst)
Class java.util.MissingResourceException loaded from parent loader (parentFirst)
Trying to override old definition of task init.failNL
 +Datatype init.failNL com.ibm.commerce.wcbd.ant.taskdefs.FailNL
Finding class com.ibm.commerce.wcbd.ant.taskdefs.ValidateProperty
Loaded from /wc/wcbd/lib/wcbd-ant.jar com/ibm/commerce/wcbd/ant/taskdefs/ValidateProperty.class
Class org.apache.tools.ant.Task loaded from parent loader (parentFirst)
Class com.ibm.commerce.wcbd.ant.taskdefs.ValidateProperty loaded from ant loader (parentFirst)
Class java.util.List loaded from parent loader (parentFirst)
Class java.lang.Throwable loaded from parent loader (parentFirst)
Class org.apache.tools.ant.BuildException loaded from parent loader (parentFirst)
Class java.lang.CharSequence loaded from parent loader (parentFirst)
Trying to override old definition of task init.validateProperty
 +Datatype init.validateProperty com.ibm.commerce.wcbd.ant.taskdefs.ValidateProperty
Property "build.type" has not been set
Condition false; setting build.type.suffix to 
Override ignored for property "build.type.suffix"
Property "build.type" has not been set
Condition false; setting build.type.prefix to 
Override ignored for property "build.type.prefix"
Class java.util.ArrayList loaded from parent loader (parentFirst)
Finding class com.ibm.commerce.wcbd.ant.typedefs.Argument
Loaded from /wc/wcbd/lib/wcbd-ant.jar com/ibm/commerce/wcbd/ant/typedefs/Argument.class
Class java.lang.Object loaded from parent loader (parentFirst)
Class com.ibm.commerce.wcbd.ant.typedefs.Argument loaded from ant loader (parentFirst)
Class java.lang.String loaded from parent loader (parentFirst)
Class java.util.Iterator loaded from parent loader (parentFirst)
Class java.util.Enumeration loaded from parent loader (parentFirst)
[available] Found file: build.properties
 [property] Loading /wc/wcbd/build.properties
Override ignored for property "mail.ssl"
Override ignored for property "log.dir"
Override ignored for property "ejbdeploy.dbvendor"
Override ignored for property "open.laszlo.web.src.dir"
Override ignored for property "working.compile.dir"
Override ignored for property "mail.failure.subject"
Override ignored for property "run.deploy.server"
Override ignored for property "ejbdeploy.no.validate"
Override ignored for property "ear.dir.includes"
Override ignored for property "deploy.toolkit.dir"
Override ignored for property "data.module.name"
Override ignored for property "ejbdeploy.codegen"
Override ignored for property "run.package.toolkit"
Override ignored for property "connector.bin.dir"
Override ignored for property "mail.failure.tolist"
Override ignored for property "run.package.server"
Override ignored for property "mail.failure.message"
Override ignored for property "db.type"
Override ignored for property "mail.mailport"
Override ignored for property "mail.success.subject"
Override ignored for property "mail.from"
Override ignored for property "deploy.server.workspace.dir"
Override ignored for property "lzc.stack.size"
Override ignored for property "log.file"
Override ignored for property "deploy.server.command"
Override ignored for property "ejbdeploy.jvm.max.memory"
Override ignored for property "java.module.list"
Override ignored for property "ejb.src.dir"
Override ignored for property "dos2unix.includes"
Override ignored for property "dist.dir"
Override ignored for property "dist.toolkit.dir"
Override ignored for property "mail.success.message"
Override ignored for property "working.dir"
Override ignored for property "web.bin.dir"
Override ignored for property "was.home"
Override ignored for property "working.package.toolkit.dir"
Override ignored for property "run.mail.success"
Override ignored for property "java.bin.dir"
Override ignored for property "deploy.server.command.args"
Override ignored for property "run.dos2unix"
Override ignored for property "ejbdeploy.keep.generated"
Override ignored for property "wc.home"
Override ignored for property "open.laszlo.web.bin.dir"
Override ignored for property "ear.dir.excludes"
Override ignored for property "run.mail.failure"
Override ignored for property "deploy.server.target.env.list"
Override ignored for property "web.content.dir"
Override ignored for property "connector.src.dir"
Override ignored for property "ejb.module.list"
Override ignored for property "static.web.module.name"
Override ignored for property "module.dir"
Override ignored for property "extract.ant.file"
Override ignored for property "deploy.server.dir"
Override ignored for property "dos2unix.excludes"
Override ignored for property "imported.classes.dir"
Override ignored for property "web.module.list"
Override ignored for property "web.src.dir"
Override ignored for property "extract.update.mode"
Override ignored for property "open.laszlo.web.content.dir"
Override ignored for property "ext.compile.class.path"
Override ignored for property "mail.success.tolist"
Override ignored for property "working.package.server.dir"
Override ignored for property "open.laszlo.web.module.list"
Override ignored for property "unit.test.lib.dir"
Override ignored for property "ejbdeploy.quiet"
Override ignored for property "working.archive.dir"
Override ignored for property "ejbdeploy.trace"
Override ignored for property "ejb.bin.dir"
Override ignored for property "source.dir"
Override ignored for property "dist.server.dir"
Override ignored for property "run.extract"
Override ignored for property "mail.mailhost"
Override ignored for property "java.src.dir"
Override ignored for property "run.clean.working.dir"
Override ignored for property "log.zip.file"
Override ignored for property "connector.module.list"
Class java.util.ArrayList loaded from parent loader (parentFirst)
Finding class com.ibm.commerce.wcbd.ant.typedefs.ValidValue
Loaded from /wc/wcbd/lib/wcbd-ant.jar com/ibm/commerce/wcbd/ant/typedefs/ValidValue.class
Class java.lang.Object loaded from parent loader (parentFirst)
Class com.ibm.commerce.wcbd.ant.typedefs.ValidValue loaded from ant loader (parentFirst)
Class java.lang.String loaded from parent loader (parentFirst)
Class java.util.Iterator loaded from parent loader (parentFirst)
Class org.apache.tools.ant.Project loaded from parent loader (parentFirst)
[available] Found file: build.private.properties
Class java.io.File loaded from parent loader (parentFirst)
Class java.lang.StringBuilder loaded from parent loader (parentFirst)
Importing file /wc/wcbd/wcbd-build-common.xml from /wc/wcbd/wcbd-build.xml
parsing buildfile /wc/wcbd/wcbd-build-common.xml with URI = file:/wc/wcbd/wcbd-build-common.xml
Setting ro project property: ant.file.wcbd-build-common -> /wc/wcbd/wcbd-build-common.xml
 +Target: extract
 +Target: wcbd-build-common.extract
 +Target: compile.archive.global
 +Target: wcbd-build-common.compile.archive.global
 +Target: compile.archive.connector
 +Target: wcbd-build-common.compile.archive.connector
 +Target: compile.archive.ejb
 +Target: wcbd-build-common.compile.archive.ejb
 +Target: compile.archive.java
 +Target: wcbd-build-common.compile.archive.java
 +Target: compile.archive.web
 +Target: wcbd-build-common.compile.archive.web
 +Target: compile.archive.open.laszlo.web
 +Target: wcbd-build-common.compile.archive.open.laszlo.web
 +Target: compile.archive.module.batch
 +Target: wcbd-build-common.compile.archive.module.batch
 +Target: compile.archive.module
 +Target: wcbd-build-common.compile.archive.module
 +Target: archive.connector.module
 +Target: wcbd-build-common.archive.connector.module
 +Target: archive.ejb.module
 +Target: wcbd-build-common.archive.ejb.module
 +Target: archive.java.module
 +Target: wcbd-build-common.archive.java.module
 +Target: archive.web.module
 +Target: wcbd-build-common.archive.web.module
 +Target: archive.open.laszlo.web.module
 +Target: wcbd-build-common.archive.open.laszlo.web.module
 +Target: copy.java.source
 +Target: wcbd-build-common.copy.java.source
 +Target: package.server
 +Target: wcbd-build-common.package.server
 +Target: copy.server.archive.module.batch
 +Target: wcbd-build-common.copy.server.archive.module.batch
 +Target: copy.server.archive.module
 +Target: wcbd-build-common.copy.server.archive.module
 +Target: package.toolkit
 +Target: wcbd-build-common.package.toolkit
 +Target: copy.toolkit.module.batch
 +Target: wcbd-build-common.copy.toolkit.module.batch
 +Target: copy.toolkit.module
 +Target: wcbd-build-common.copy.toolkit.module
 +Target: generate.wcbd.build.info
 +Target: wcbd-build-common.generate.wcbd.build.info
 +Target: dos2unix
 +Target: wcbd-build-common.dos2unix
 +Target: deploy.server
 +Target: wcbd-build-common.deploy.server
 +Target: deploy.server.target.env
 +Target: wcbd-build-common.deploy.server.target.env
 +Target: clean.working.dir
 +Target: wcbd-build-common.clean.working.dir
 +Target: mail.success
 +Target: wcbd-build-common.mail.success
 +Target: mail.failure
 +Target: wcbd-build-common.mail.failure
 +Target: mail
 +Target: wcbd-build-common.mail
parsing buildfile jar:file:/wc/wcbd/lib/ant-contrib-1.0b3.jar!/net/sf/antcontrib/antlib.xml with URI = jar:file:/wc/wcbd/lib/ant-contrib-1.0b3.jar!/net/sf/antcontrib/antlib.xml
Class net.sf.antcontrib.property.PropertyCopy loaded from parent loader (parentFirst)
Class net.sf.antcontrib.platform.ShellScriptTask loaded from parent loader (parentFirst)
Class net.sf.antcontrib.property.PathToFileSet loaded from parent loader (parentFirst)
Class net.sf.antcontrib.logic.RunTargetTask loaded from parent loader (parentFirst)
Class net.sf.antcontrib.antserver.client.ClientTask loaded from parent loader (parentFirst)
Class net.sf.antcontrib.property.RegexTask loaded from parent loader (parentFirst)
Class net.sf.antcontrib.logic.Assert loaded from parent loader (parentFirst)
Class net.sf.antcontrib.math.MathTask loaded from parent loader (parentFirst)
Class net.sf.antcontrib.logic.TryCatchTask loaded from parent loader (parentFirst)
Class net.sf.antcontrib.antserver.server.ServerTask loaded from parent loader (parentFirst)
Class net.sf.antcontrib.logic.AntCallBack loaded from parent loader (parentFirst)
Class net.sf.antcontrib.walls.CompileWithWalls loaded from parent loader (parentFirst)
Class net.sf.antcontrib.logic.OutOfDate loaded from parent loader (parentFirst)
Class net.sf.antcontrib.platform.OsFamily loaded from parent loader (parentFirst)
Class net.sf.antcontrib.perf.StopWatchTask loaded from parent loader (parentFirst)
Class net.sf.antcontrib.logic.Throw loaded from parent loader (parentFirst)
Class net.sf.antcontrib.antclipse.ClassPathTask loaded from parent loader (parentFirst)
Class net.sf.antcontrib.property.URLEncodeTask loaded from parent loader (parentFirst)
Class net.sf.antcontrib.logic.TimestampSelector loaded from parent loader (parentFirst)
Class net.sf.antcontrib.logic.ForEach loaded from parent loader (parentFirst)
Class net.sf.antcontrib.logic.IfTask loaded from parent loader (parentFirst)
Class net.sf.antcontrib.property.PropertySelector loaded from parent loader (parentFirst)
Class net.sf.antcontrib.property.SortList loaded from parent loader (parentFirst)
Class net.sf.antcontrib.logic.AntFetch loaded from parent loader (parentFirst)
Class net.sf.antcontrib.net.PostTask loaded from parent loader (parentFirst)
Class net.sf.antcontrib.process.ForgetTask loaded from parent loader (parentFirst)
Class net.sf.antcontrib.process.Limit loaded from parent loader (parentFirst)
Class net.sf.antcontrib.logic.Switch loaded from parent loader (parentFirst)
Class net.sf.antcontrib.logic.Relentless loaded from parent loader (parentFirst)
Class net.sf.antcontrib.property.Variable loaded from parent loader (parentFirst)
Class net.sf.antcontrib.inifile.IniFileTask loaded from parent loader (parentFirst)
Class net.sf.antcontrib.design.VerifyDesign loaded from parent loader (parentFirst)
Class net.sf.antcontrib.logic.ForTask loaded from parent loader (parentFirst)
Class net.sf.antcontrib.net.httpclient.HttpStateType loaded from parent loader (parentFirst)
Class net.sf.antcontrib.net.httpclient.HttpClientType loaded from parent loader (parentFirst)
Class net.sf.antcontrib.net.httpclient.GetCookieTask loaded from parent loader (parentFirst)
Class net.sf.antcontrib.net.httpclient.AddCookieTask loaded from parent loader (parentFirst)
Class net.sf.antcontrib.net.httpclient.ClearCookiesTask loaded from parent loader (parentFirst)
Class net.sf.antcontrib.net.httpclient.AddCredentialsTask loaded from parent loader (parentFirst)
Class net.sf.antcontrib.net.httpclient.ClearCredentialsTask loaded from parent loader (parentFirst)
Class net.sf.antcontrib.net.httpclient.PurgeExpiredCookiesTask loaded from parent loader (parentFirst)
Class net.sf.antcontrib.net.httpclient.PostMethodTask loaded from parent loader (parentFirst)
Class net.sf.antcontrib.net.httpclient.GetMethodTask loaded from parent loader (parentFirst)
Class net.sf.antcontrib.net.httpclient.HeadMethodTask loaded from parent loader (parentFirst)
Class net.sf.antcontrib.net.URLImportTask loaded from parent loader (parentFirst)
    [mkdir] Skipping /wc/wcbd/ut-lib because it already exists.
Adding reference: was.class.path
 [loadfile] loading /opt/IBM/WebSphere/CommerceServer70/properties/version/COMMERCE.product into property product.file.str
 [loadfile] resource size = 248
Override ignored for property "product.file.str"
 [loadfile] loaded 248 characters
 [loadfile] product.file.str := <?xml version="1.0" encoding="UTF-8"?>
 [loadfile] <!DOCTYPE product PUBLIC "productId" "dtd/product.dtd">
 [loadfile] <product name="IBM WebSphere Commerce">
 [loadfile]   <id>wc.server.be</id>
 [loadfile]   <version>7.0.0.6</version>
 [loadfile]   <build-info date="17/06/12" level="120617sup"/>
 [loadfile] </product>
Adding reference: wc.ear.compile.class.path
Adding reference: compile.class.path
fileset: Setup scanner in dir /opt/IBM/WebSphere/AppServer with patternSet{ includes: [lib/**/*.jar, plugins/**/*.jar] excludes: [plugins/nls/**/*.jar] }
parsing buildfile jar:file:/wc/wcbd/lib/wcbd-ant.jar!/com/ibm/commerce/wcbd/ant/antlib.xml with URI = jar:file:/wc/wcbd/lib/wcbd-ant.jar!/com/ibm/commerce/wcbd/ant/antlib.xml
Finding class com.ibm.commerce.wcbd.ant.taskdefs.ConfigureDeltaDeployment
Loaded from /wc/wcbd/lib/wcbd-ant.jar com/ibm/commerce/wcbd/ant/taskdefs/ConfigureDeltaDeployment.class
Class org.apache.tools.ant.Task loaded from parent loader (parentFirst)
Class com.ibm.commerce.wcbd.ant.taskdefs.ConfigureDeltaDeployment loaded from ant loader (parentFirst)
Class java.util.List loaded from parent loader (parentFirst)
Class java.util.Set loaded from parent loader (parentFirst)
Class java.util.Collection loaded from parent loader (parentFirst)
Class java.io.InputStream loaded from parent loader (parentFirst)
Class java.io.FileInputStream loaded from parent loader (parentFirst)
Class java.io.Writer loaded from parent loader (parentFirst)
Class java.io.FileWriter loaded from parent loader (parentFirst)
Class java.lang.Throwable loaded from parent loader (parentFirst)
Class org.apache.tools.ant.BuildException loaded from parent loader (parentFirst)
Class java.io.IOException loaded from parent loader (parentFirst)
Class javax.xml.parsers.ParserConfigurationException loaded from parent loader (parentFirst)
Class javax.xml.transform.TransformerException loaded from parent loader (parentFirst)
Class java.util.Map loaded from parent loader (parentFirst)
Class java.io.OutputStream loaded from parent loader (parentFirst)
Class java.io.FileOutputStream loaded from parent loader (parentFirst)
Class java.util.HashSet loaded from parent loader (parentFirst)
Trying to override old definition of task configDeltaDeploy
 +Datatype configDeltaDeploy com.ibm.commerce.wcbd.ant.taskdefs.ConfigureDeltaDeployment
Finding class com.ibm.commerce.wcbd.ant.taskdefs.DecodeLoadProperties
Loaded from /wc/wcbd/lib/wcbd-ant.jar com/ibm/commerce/wcbd/ant/taskdefs/DecodeLoadProperties.class
Class com.ibm.commerce.wcbd.ant.taskdefs.DecodeLoadProperties loaded from ant loader (parentFirst)
Trying to override old definition of task decodeLoadProperties
 +Datatype decodeLoadProperties com.ibm.commerce.wcbd.ant.taskdefs.DecodeLoadProperties
Finding class com.ibm.commerce.wcbd.ant.taskdefs.Dos2Unix
Loaded from /wc/wcbd/lib/wcbd-ant.jar com/ibm/commerce/wcbd/ant/taskdefs/Dos2Unix.class
Class org.apache.tools.ant.taskdefs.MatchingTask loaded from parent loader (parentFirst)
Class com.ibm.commerce.wcbd.ant.taskdefs.Dos2Unix loaded from ant loader (parentFirst)
Class java.lang.Exception loaded from parent loader (parentFirst)
Trying to override old definition of task dos2unix
 +Datatype dos2unix com.ibm.commerce.wcbd.ant.taskdefs.Dos2Unix
Finding class com.ibm.commerce.wcbd.ant.taskdefs.EchoNL
Loaded from /wc/wcbd/lib/wcbd-ant.jar com/ibm/commerce/wcbd/ant/taskdefs/EchoNL.class
Class com.ibm.commerce.wcbd.ant.taskdefs.EchoNL loaded from ant loader (parentFirst)
Class java.util.MissingResourceException loaded from parent loader (parentFirst)
Trying to override old definition of task echoNL
 +Datatype echoNL com.ibm.commerce.wcbd.ant.taskdefs.EchoNL
Finding class com.ibm.commerce.wcbd.ant.taskdefs.EditPropertiesFile
Loaded from /wc/wcbd/lib/wcbd-ant.jar com/ibm/commerce/wcbd/ant/taskdefs/EditPropertiesFile.class
Class com.ibm.commerce.wcbd.ant.taskdefs.EditPropertiesFile loaded from ant loader (parentFirst)
Class java.io.Reader loaded from parent loader (parentFirst)
Class java.io.FileReader loaded from parent loader (parentFirst)
Trying to override old definition of task editPropertiesFile
 +Datatype editPropertiesFile com.ibm.commerce.wcbd.ant.taskdefs.EditPropertiesFile
Finding class com.ibm.commerce.wcbd.ant.taskdefs.EncodeProperties
Loaded from /wc/wcbd/lib/wcbd-ant.jar com/ibm/commerce/wcbd/ant/taskdefs/EncodeProperties.class
Class com.ibm.commerce.wcbd.ant.taskdefs.EncodeProperties loaded from ant loader (parentFirst)
Class java.io.StringWriter loaded from parent loader (parentFirst)
Trying to override old definition of task encodeProperties
 +Datatype encodeProperties com.ibm.commerce.wcbd.ant.taskdefs.EncodeProperties
Finding class com.ibm.commerce.wcbd.ant.taskdefs.EvalXPath
Loaded from /wc/wcbd/lib/wcbd-ant.jar com/ibm/commerce/wcbd/ant/taskdefs/EvalXPath.class
Class com.ibm.commerce.wcbd.ant.taskdefs.EvalXPath loaded from ant loader (parentFirst)
Class org.w3c.dom.Node loaded from parent loader (parentFirst)
Class org.xml.sax.SAXException loaded from parent loader (parentFirst)
Trying to override old definition of task evalXPath
 +Datatype evalXPath com.ibm.commerce.wcbd.ant.taskdefs.EvalXPath
Finding class com.ibm.commerce.wcbd.ant.taskdefs.FailNL
Loaded from /wc/wcbd/lib/wcbd-ant.jar com/ibm/commerce/wcbd/ant/taskdefs/FailNL.class
Class com.ibm.commerce.wcbd.ant.taskdefs.FailNL loaded from ant loader (parentFirst)
Class org.apache.tools.ant.taskdefs.condition.ConditionBase loaded from parent loader (parentFirst)
Finding class com.ibm.commerce.wcbd.ant.taskdefs.FailNL$NestedCondition
Loaded from /wc/wcbd/lib/wcbd-ant.jar com/ibm/commerce/wcbd/ant/taskdefs/FailNL$NestedCondition.class
Class org.apache.tools.ant.taskdefs.condition.Condition loaded from parent loader (parentFirst)
Class com.ibm.commerce.wcbd.ant.taskdefs.FailNL$NestedCondition loaded from ant loader (parentFirst)
Trying to override old definition of task failNL
 +Datatype failNL com.ibm.commerce.wcbd.ant.taskdefs.FailNL
Finding class com.ibm.commerce.wcbd.ant.taskdefs.PrintStackTrace
Loaded from /wc/wcbd/lib/wcbd-ant.jar com/ibm/commerce/wcbd/ant/taskdefs/PrintStackTrace.class
Class com.ibm.commerce.wcbd.ant.taskdefs.PrintStackTrace loaded from ant loader (parentFirst)
Trying to override old definition of task printStackTrace
 +Datatype printStackTrace com.ibm.commerce.wcbd.ant.taskdefs.PrintStackTrace
Finding class com.ibm.commerce.wcbd.ant.taskdefs.SetSystemProperty
Loaded from /wc/wcbd/lib/wcbd-ant.jar com/ibm/commerce/wcbd/ant/taskdefs/SetSystemProperty.class
Class com.ibm.commerce.wcbd.ant.taskdefs.SetSystemProperty loaded from ant loader (parentFirst)
Trying to override old definition of task setSystemProperty
 +Datatype setSystemProperty com.ibm.commerce.wcbd.ant.taskdefs.SetSystemProperty
Finding class com.ibm.commerce.wcbd.ant.taskdefs.ToURI
Loaded from /wc/wcbd/lib/wcbd-ant.jar com/ibm/commerce/wcbd/ant/taskdefs/ToURI.class
Class com.ibm.commerce.wcbd.ant.taskdefs.ToURI loaded from ant loader (parentFirst)
Trying to override old definition of task toURI
 +Datatype toURI com.ibm.commerce.wcbd.ant.taskdefs.ToURI
Finding class com.ibm.commerce.wcbd.ant.taskdefs.ValidateProperty
Loaded from /wc/wcbd/lib/wcbd-ant.jar com/ibm/commerce/wcbd/ant/taskdefs/ValidateProperty.class
Class com.ibm.commerce.wcbd.ant.taskdefs.ValidateProperty loaded from ant loader (parentFirst)
Class java.lang.CharSequence loaded from parent loader (parentFirst)
Trying to override old definition of task validateProperty
 +Datatype validateProperty com.ibm.commerce.wcbd.ant.taskdefs.ValidateProperty
Finding class com.ibm.commerce.wcbd.ant.taskdefs.condition.ContainsInFileSet
Loaded from /wc/wcbd/lib/wcbd-ant.jar com/ibm/commerce/wcbd/ant/taskdefs/condition/ContainsInFileSet.class
Class java.lang.Object loaded from parent loader (parentFirst)
Class com.ibm.commerce.wcbd.ant.taskdefs.condition.ContainsInFileSet loaded from ant loader (parentFirst)
Trying to override old definition of datatype containsInFileSet
 +Datatype containsInFileSet com.ibm.commerce.wcbd.ant.taskdefs.condition.ContainsInFileSet
Finding class com.ibm.commerce.wcbd.ant.taskdefs.condition.StringLengthCompare
Loaded from /wc/wcbd/lib/wcbd-ant.jar com/ibm/commerce/wcbd/ant/taskdefs/condition/StringLengthCompare.class
Class com.ibm.commerce.wcbd.ant.taskdefs.condition.StringLengthCompare loaded from ant loader (parentFirst)
Trying to override old definition of datatype stringLengthCompare
 +Datatype stringLengthCompare com.ibm.commerce.wcbd.ant.taskdefs.condition.StringLengthCompare
Finding class com.ibm.commerce.wcbd.ant.taskdefs.condition.NumberCompare
Loaded from /wc/wcbd/lib/wcbd-ant.jar com/ibm/commerce/wcbd/ant/taskdefs/condition/NumberCompare.class
Class com.ibm.commerce.wcbd.ant.taskdefs.condition.NumberCompare loaded from ant loader (parentFirst)
Class java.lang.ClassNotFoundException loaded from parent loader (parentFirst)
Class java.lang.InstantiationException loaded from parent loader (parentFirst)
Class java.lang.IllegalAccessException loaded from parent loader (parentFirst)
Trying to override old definition of datatype numberCompare
 +Datatype numberCompare com.ibm.commerce.wcbd.ant.taskdefs.condition.NumberCompare
 [macrodef] creating macro  echoSkipTarget
Class java.io.File loaded from parent loader (parentFirst)
Class java.io.BufferedReader loaded from parent loader (parentFirst)
Class java.io.PrintWriter loaded from parent loader (parentFirst)
Class java.lang.String loaded from parent loader (parentFirst)
Class com.ibm.ws.security.util.WSEncoderDecoder loaded from parent loader (parentFirst)
Class java.lang.StringBuilder loaded from parent loader (parentFirst)
Class java.util.Properties loaded from parent loader (parentFirst)
Class java.util.Iterator loaded from parent loader (parentFirst)
Finding class com.ibm.commerce.wcbd.ant.taskdefs.DecodeLoadProperties$ExtendedProperty
Loaded from /wc/wcbd/lib/wcbd-ant.jar com/ibm/commerce/wcbd/ant/taskdefs/DecodeLoadProperties$ExtendedProperty.class
Class org.apache.tools.ant.taskdefs.Property loaded from parent loader (parentFirst)
Class com.ibm.commerce.wcbd.ant.taskdefs.DecodeLoadProperties$ExtendedProperty loaded from ant loader (parentFirst)
Override ignored for property "mail.password"
Override ignored for property "mail.user"
Build sequence for target(s) `mail' is [mail]
Complete build sequence is [mail, copy.toolkit.module, deploy.server.target.env, wcbd-build-common.compile.archive.connector, wcbd-build-common.extract, wcbd-build-common.archive.web.module, wcbd-build-common.compile.archive.global, copy.java.source, wcbd-build-common.compile.archive.module, wcbd-build-common.copy.java.source, archive.java.module, wcbd-build-common.deploy.server, wcbd-build-common.compile.archive.java, wcbd-build-common.deploy.server.target.env, wcbd-build-common.compile.archive.web, mail.success, compile.archive.ejb, package.toolkit, wcbd-build-common.copy.server.archive.module, archive.connector.module, wcbd-build-common.clean.working.dir, wcbd-build-common.package.toolkit, compile.archive.open.laszlo.web, all, compile.archive.connector, deploy.server, copy.server.archive.module.batch, wcbd-build-common.archive.ejb.module, wcbd-build-common.mail.success, package.server, wcbd-build-common.copy.toolkit.module, extract, wcbd-build-common.package.server, compile.archive.module.batch, archive.web.module, dos2unix, wcbd-build-common.dos2unix, generate.wcbd.build.info, wcbd-build-common.copy.server.archive.module.batch, wcbd-build-common.archive.connector.module, wcbd-build-common.mail, mail.failure, archive.open.laszlo.web.module, compile.archive.java, wcbd-build-common.copy.toolkit.module.batch, wcbd-build-common.archive.java.module, wcbd-build-common.compile.archive.module.batch, wcbd-build-common.generate.wcbd.build.info, wcbd-build-common.compile.archive.ejb, build, wcbd-build-common.compile.archive.open.laszlo.web, wcbd-build-common.mail.failure, compile.archive.web, compile.archive.global, clean.working.dir, archive.ejb.module, compile.archive.module, copy.server.archive.module, copy.toolkit.module.batch, , wcbd-build-common.archive.open.laszlo.web.module]
  [antcall] Entering /wc/wcbd/wcbd-build.xml...
Build sequence for target(s) `mail' is [mail]
Complete build sequence is [mail, copy.toolkit.module, deploy.server.target.env, wcbd-build-common.compile.archive.connector, wcbd-build-common.extract, wcbd-build-common.archive.web.module, wcbd-build-common.compile.archive.global, copy.java.source, wcbd-build-common.compile.archive.module, wcbd-build-common.copy.java.source, archive.java.module, wcbd-build-common.deploy.server, wcbd-build-common.compile.archive.java, wcbd-build-common.deploy.server.target.env, wcbd-build-common.compile.archive.web, mail.success, compile.archive.ejb, package.toolkit, wcbd-build-common.copy.server.archive.module, archive.connector.module, wcbd-build-common.clean.working.dir, wcbd-build-common.package.toolkit, compile.archive.open.laszlo.web, all, compile.archive.connector, deploy.server, copy.server.archive.module.batch, wcbd-build-common.archive.ejb.module, wcbd-build-common.mail.success, package.server, wcbd-build-common.copy.toolkit.module, extract, wcbd-build-common.package.server, compile.archive.module.batch, archive.web.module, dos2unix, wcbd-build-common.dos2unix, generate.wcbd.build.info, wcbd-build-common.copy.server.archive.module.batch, wcbd-build-common.archive.connector.module, wcbd-build-common.mail, mail.failure, archive.open.laszlo.web.module, compile.archive.java, wcbd-build-common.copy.toolkit.module.batch, wcbd-build-common.archive.java.module, wcbd-build-common.compile.archive.module.batch, wcbd-build-common.generate.wcbd.build.info, wcbd-build-common.compile.archive.ejb, build, wcbd-build-common.compile.archive.open.laszlo.web, wcbd-build-common.mail.failure, compile.archive.web, compile.archive.global, clean.working.dir, archive.ejb.module, compile.archive.module, copy.server.archive.module, copy.toolkit.module.batch, , wcbd-build-common.archive.open.laszlo.web.module]
 
mail:
Condition false; not setting files
     [mail] Using MIME mail
     [mail] Sending email: WCBD Build FAILED: 2018-08-29-MRF17APR-3_B1.0
     [mail] From wcuser@rhwcwas11
     [mail] ReplyTo []
     [mail] To [john.kinder@sampleglobal.com]
     [mail] Cc []
     [mail] Bcc []
     [mail] Sent email with 1 attachment
  [antcall] Exiting /wc/wcbd/wcbd-build.xml.
  [antcall] Exiting /wc/wcbd/wcbd-build.xml.
     [fail] failing due to The following error occurred while executing this line:
     [fail] /wc/wcbd/wcbd-build.xml:175: The following error occurred while executing this line:
     [fail] /wc/wcbd/wcbd-build-common.xml:396: The following error occurred while executing this line:
     [fail] /wc/wcbd/wcbd-build-common.xml:476: The following error occurred while executing this line:
     [fail] /wc/wcbd/wcbd-build-common.xml:519: The following error occurred while executing this line:
     [fail] /wc/wcbd/wcbd-build-common.xml:690: Java returned: 1
 
BUILD FAILED
/wc/wcbd/wcbd-build.xml:150: The following error occurred while executing this line:
/wc/wcbd/wcbd-build.xml:175: The following error occurred while executing this line:
/wc/wcbd/wcbd-build-common.xml:396: The following error occurred while executing this line:
/wc/wcbd/wcbd-build-common.xml:476: The following error occurred while executing this line:
/wc/wcbd/wcbd-build-common.xml:519: The following error occurred while executing this line:
/wc/wcbd/wcbd-build-common.xml:690: Java returned: 1
at org.apache.tools.ant.taskdefs.Exit.execute(Exit.java:142)
at org.apache.tools.ant.UnknownElement.execute(UnknownElement.java:288)
at sun.reflect.GeneratedMethodAccessor3.invoke(Unknown Source)
at sun.reflect.DelegatingMethodAccessorImpl.invoke(DelegatingMethodAccessorImpl.java:37)
at java.lang.reflect.Method.invoke(Method.java:611)
at org.apache.tools.ant.dispatch.DispatchUtils.execute(DispatchUtils.java:106)
at org.apache.tools.ant.Task.perform(Task.java:348)
at org.apache.tools.ant.taskdefs.Sequential.execute(Sequential.java:62)
at net.sf.antcontrib.logic.TryCatchTask$CatchBlock.execute(TryCatchTask.java:137)
at net.sf.antcontrib.logic.TryCatchTask.execute(TryCatchTask.java:225)
at org.apache.tools.ant.UnknownElement.execute(UnknownElement.java:288)
at sun.reflect.GeneratedMethodAccessor3.invoke(Unknown Source)
at sun.reflect.DelegatingMethodAccessorImpl.invoke(DelegatingMethodAccessorImpl.java:37)
at java.lang.reflect.Method.invoke(Method.java:611)
at org.apache.tools.ant.dispatch.DispatchUtils.execute(DispatchUtils.java:106)
at org.apache.tools.ant.Task.perform(Task.java:348)
at org.apache.tools.ant.Target.execute(Target.java:357)
at org.apache.tools.ant.Target.performTasks(Target.java:385)
at org.apache.tools.ant.Project.executeSortedTargets(Project.java:1337)
at org.apache.tools.ant.Project.executeTarget(Project.java:1306)
at org.apache.tools.ant.helper.DefaultExecutor.executeTargets(DefaultExecutor.java:41)
at org.apache.tools.ant.Project.executeTargets(Project.java:1189)
at org.apache.tools.ant.Main.runBuild(Main.java:758)
at org.apache.tools.ant.Main.startAnt(Main.java:217)
at org.apache.tools.ant.launch.Launcher.run(Launcher.java:257)
at org.apache.tools.ant.launch.Launcher.main(Launcher.java:104)
 
Total time: 2 minutes 2 seconds
  • IgorMonteiro
    IgorMonteiro
    1 Post

    Re: Websphere Commerce Build failed

    ‏2018-09-02T21:49:38Z  

    What is stated on line 133 wcbd-build.xml and log file

    wc/wcbd/logs/2018-08-29-MRF17APR-3_B1.0-20180829125332/wcbd-build-log-2018-08-29-MRF17APR-3_B1.0.zip?